Uploaded image for project: 'PUBLIC - Liferay Commerce'
  1. PUBLIC - Liferay Commerce
  2. COMMERCE-5048

Element is not present at CPCommercePriceLists#AssertPriceListCanBeAssociatedWithAccountAndAccountGroup

    Details

      Description

      Testray

      Poshi

      Jenkins

       [exec] com.liferay.poshi.runner.PoshiRunner > test[LocalFile.CPCommercePriceLists#AssertPriceListCanBeAssociatedWithAccountAndAccountGroup] STANDARD_ERROR
           [exec]     Starting ChromeDriver 2.37.544315 (730aa6a5fdba159ac9f4c1e8cbc59bf1b5ce12b7) on port 25087
           [exec]     Only local connections are allowed.
           [exec]     Oct 29, 2020 12:09:52 AM org.openqa.selenium.remote.ProtocolHandshake createSession
           [exec]     INFO: Detected dialect: OSS
           [exec] 
           [exec] com.liferay.poshi.runner.PoshiRunner > test[LocalFile.CPCommercePriceLists#AssertPriceListCanBeAssociatedWithAccountAndAccountGroup] STANDARD_OUT
           [exec] 
           [exec]     BUILD FAILED: Element is not present at "//*[@data-qa-id='row']//*[text()='Test Test']//..//input[@type='checkbox'] | //tr[@data-name='Test Test']//input[@type="checkbox"] | //*[@data-qa-id='row' and contains(.,'Test Test')]//input[@type='checkbox']"
           [exec]     /opt/dev/projects/github/liferay-portal/modules/apps/commerce/commerce-product-test/src/testFunctional/macros/CommerceItemSelector.macro[selectEntry]:16
           [exec]     /opt/dev/projects/github/liferay-portal/modules/apps/commerce/commerce-product-test/src/testFunctional/macros/CommerceEntry.macro[addNewAccountsEntry]:30
           [exec]     /opt/dev/projects/github/liferay-portal/modules/apps/commerce/commerce-product-test/src/testFunctional/macros/CommerceEntry.macro[createNewAccountGroup]:400
           [exec]     /opt/dev/projects/github/liferay-portal/modules/apps/commerce/commerce-product-test/src/testFunctional/tests/CPCommercePriceLists.testcase[AssertPriceListCanBeAssociatedWithAccountAndAccountGroup]:181
           [exec] 
           [exec] 
           [exec] com.liferay.poshi.runner.PoshiRunner > test[LocalFile.CPCommercePriceLists#AssertPriceListCanBeAssociatedWithAccountAndAccountGroup] STANDARD_ERROR
           [exec]     com.liferay.poshi.runner.exception.ElementNotFoundPoshiRunnerException: Element is not present at "//*[@data-qa-id='row']//*[text()='Test Test']//..//input[@type='checkbox'] | //tr[@data-name='Test Test']//input[@type="checkbox"] | //*[@data-qa-id='row' and contains(.,'Test Test')]//input[@type='checkbox']"
           [exec]     	at com.liferay.poshi.runner.selenium.BaseWebDriverImpl.getWebElement(BaseWebDriverImpl.java:4371)
           [exec]     	at com.liferay.poshi.runner.selenium.ChromeWebDriverImpl.getWebElement(ChromeWebDriverImpl.java:131)
           [exec]     	at com.liferay.poshi.runner.selenium.BaseWebDriverImpl.getWebElement(BaseWebDriverImpl.java:4361)
           [exec]     	at com.liferay.poshi.runner.selenium.BaseWebDriverImpl$26.evaluate(BaseWebDriverImpl.java:4334)
           [exec]     	at com.liferay.poshi.runner.selenium.BaseWebDriverImpl.isVisibleInPage(BaseWebDriverImpl.java:1806)
           [exec]     	at com.liferay.poshi.runner.selenium.BaseWebDriverImpl$25.evaluate(BaseWebDriverImpl.java:4320)
           [exec]     	at com.liferay.poshi.runner.selenium.BaseWebDriverImpl$Condition.assertTrue(BaseWebDriverImpl.java:4575)
           [exec]     	at com.liferay.poshi.runner.selenium.BaseWebDriverImpl$Condition.waitFor(BaseWebDriverImpl.java:4611)
           [exec]     	at com.liferay.poshi.runner.selenium.BaseWebDriverImpl.waitForVisible(BaseWebDriverImpl.java:3530)
           [exec]     	at sun.reflect.GeneratedMethodAccessor6.invoke(Unknown Source)
           [exec]     	at sun.reflect.DelegatingMethodAccessorImpl.invoke(DelegatingMethodAccessorImpl.java:43)
           [exec]     	at java.lang.reflect.Method.invoke(Method.java:498)
           [exec]     	at com.liferay.poshi.runner.PoshiRunnerExecutor$1.call(PoshiRunnerExecutor.java:1190)
           [exec]     	at java.util.concurrent.FutureTask.run(FutureTask.java:266)
           [exec]     	at java.util.concurrent.ThreadPoolExecutor.runWorker(ThreadPoolExecutor.java:1142)
           [exec]     	at java.util.concurrent.ThreadPoolExecutor$Worker.run(ThreadPoolExecutor.java:617)
           [exec]     	at java.lang.Thread.run(Thread.java:745)
           [exec] 
           [exec] com.liferay.poshi.runner.PoshiRunner > test[LocalFile.CPCommercePriceLists#AssertPriceListCanBeAssociatedWithAccountAndAccountGroup] FAILED
           [exec]     com.liferay.poshi.runner.exception.ElementNotFoundPoshiRunnerException at BaseWebDriverImpl.java:4371
           [exec] 
      

        Attachments

          Issue Links

            Activity

              People

              Assignee:
              Unassigned
              Reporter:
              calvin.vo Calvin Vo
              Votes:
              0 Vote for this issue
              Watchers:
              0 Start watching this issue

                Dates

                Created:
                Updated:
                Resolved:

                  Packages

                  Version Package
                  7.4 CE GA1