Uploaded image for project: 'PUBLIC - Liferay Commerce'
  1. PUBLIC - Liferay Commerce
  2. COMMERCE-7937

Expected text does not match at CommerceAccelerators#MiniumSiteFullFlowCheckingOutViaOrderDetails

    Details

    • Severity of Issue:
      Major

      Description

      Testray
      Poshi
      Jenkins

           [exec]     BUILD FAILED: Expected text "2" does not match actual text (case insensitive) "2 piece(s)" at "//div[contains(@class,'tbody')]/div/div[7]"
           [exec]     /opt/dev/projects/github/liferay-portal/modules/apps/commerce/commerce-product-test/src/testFunctional/macros/CommerceAcceleratorsInitializer.macro[reviewOrder]:223
           [exec]     /opt/dev/projects/github/liferay-portal/modules/apps/commerce/commerce-product-test/src/testFunctional/tests/CommerceAccelerators.testcase[MiniumSiteFullFlowCheckingOutViaOrderDetails]:800
           [exec] 
           [exec] 
           [exec] com.liferay.poshi.runner.PoshiRunner > test[LocalFile.CommerceAccelerators#MiniumSiteFullFlowCheckingOutViaOrderDetails] STANDARD_ERROR
           [exec]     java.lang.Exception: Expected text "2" does not match actual text (case insensitive) "2 piece(s)" at "//div[contains(@class,'tbody')]/div/div[7]"
           [exec]     	at com.liferay.poshi.runner.selenium.BaseWebDriverImpl$20.assertTrue(BaseWebDriverImpl.java:4284)
      
           [exec]     BUILD FAILED: Expected text "2" does not match actual text (case insensitive) "2 piece(s)" at "//div[@class='dnd-td' and contains(.,'2')]"
           [exec]     /opt/dev/projects/github/liferay-portal/modules/apps/commerce/commerce-product-test/src/testFunctional/macros/CommerceOrders.macro[viewOrdersEntry]:180
           [exec]     /opt/dev/projects/github/liferay-portal/modules/apps/commerce/commerce-product-test/src/testFunctional/tests/CommerceAccelerators.testcase[SpeedwellSiteFullFlow]:969
           [exec] 
           [exec] 
           [exec] com.liferay.poshi.runner.PoshiRunner > test[LocalFile.CommerceAccelerators#SpeedwellSiteFullFlow] STANDARD_ERROR
           [exec]     java.lang.Exception: Expected text "2" does not match actual text (case insensitive) "2 piece(s)" at "//div[@class='dnd-td' and contains(.,'2')]"
           [exec]     	at com.liferay.poshi.runner.selenium.BaseWebDriverImpl$20.assertTrue(BaseWebDriverImpl.java:4284)
      

        Attachments

          Activity

            People

            Assignee:
            lorenzo.lapescara Lorenzo La Pescara
            Reporter:
            susan.chen Susan Chen
            Votes:
            0 Vote for this issue
            Watchers:
            1 Start watching this issue

              Dates

              Created:
              Updated:
              Resolved:

                Packages

                Version Package