Uploaded image for project: 'PUBLIC - Liferay IDE'
  1. PUBLIC - Liferay IDE
  2. IDE-3084

Init bundle failed when upgrade to liferay workspace

    Details

    • Type: Bug
    • Status: Closed
    • Priority: Minor
    • Resolution: Won't Fix
    • Affects Version/s: 3.1 M2
    • Fix Version/s: None
    • Component/s: Upgrade Planner
    • Labels:
      None

      Description

      (1)upgrade the 6.2 sdk project to liferay workspace
      (2)there are showing error in the console and Error log
      Console:

      Working Directory: D:\6.2\devcon-test-project-master-0113-am1115\devcon-test-project-master
      Gradle User Home: C:\Users\liferay\.gradle
      Gradle Distribution: Gradle wrapper from target build
      Gradle Version: 3.0
      Java Home: C:\Program Files\Java\jdk1.8.0_91
      JVM Arguments: None
      Program Arguments: None
      Gradle Tasks: initBundle

      :downloadBundle
      Invalid cookie header: "Set-Cookie: VISITOR=58784676b6cbcd0c538fa52d; expires="Mon, 11-Jan-2027 03:16:06 GMT"; httponly; Max-Age=315360000; Path=/". Invalid 'expires' attribute: "Mon, 11-Jan-2027 03:16:06 GMT"
      Invalid cookie header: "Set-Cookie: VISITOR=58784676b6cbcd0c538fa52d; expires="Mon, 11-Jan-2027 03:16:08 GMT"; httponly; Max-Age=315360000; Path=/". Invalid 'expires' attribute: "Mon, 11-Jan-2027 03:16:08 GMT"
      Invalid cookie header: "Set-Cookie: sf_mirror_attempt="lportal:jaist:Liferay%20Portal/7.0.2%20GA3/liferay-ce-portal-tomcat-7.0-ga3-20160804222206210.zip"; expires=120; Path=/". Invalid 'expires' attribute: 120
      :downloadBundle FAILED

      FAILURE: Build failed with an exception.

      • What went wrong:
        Execution failed for task ':downloadBundle'.
        > javax.net.ssl.SSLHandshakeException: sun.security.validator.ValidatorException: PKIX path building failed: sun.security.provider.certpath.SunCertPathBuilderException: unable to find valid certification path to requested target
      • Try:
        Run with --stacktrace option to get the stack trace. Run with --info or --debug option to get more log output.

      BUILD FAILED

      Total time: 10.57 secs

        Attachments

        1. error01.png
          error01.png
          208 kB
        2. error02.png
          error02.png
          86 kB

          Activity

            People

            Assignee:
            lr_ide LR IDE
            Reporter:
            sunny.shi Sunny Shi (Inactive)
            Participants of an Issue:
            Votes:
            0 Vote for this issue
            Watchers:
            0 Start watching this issue

              Dates

              Created:
              Updated:
              Resolved:
              Days since last comment:
              4 years, 27 weeks, 6 days ago

                Packages

                Version Package