Uploaded image for project: 'PUBLIC - Liferay Portal Community Edition'
  1. PUBLIC - Liferay Portal Community Edition
  2. LPS-100431

Modules compile failure for journal-test on 7.2.x

    Details

      Description

      Failing on 7.2.x-private and 7.2.x

            [exec] * Exception is:
           [exec] org.gradle.api.tasks.TaskExecutionException: Execution failed for task ':apps:journal:journal-test:compileTestIntegrationJava'.
           [exec] 	at org.gradle.api.internal.tasks.execution.ExecuteActionsTaskExecuter.executeActions(ExecuteActionsTaskExecuter.java:110)
           [exec] 	at org.gradle.api.internal.tasks.execution.ExecuteActionsTaskExecuter.execute(ExecuteActionsTaskExecuter.java:77)
           [exec] 	at org.gradle.api.internal.tasks.execution.OutputDirectoryCreatingTaskExecuter.execute(OutputDirectoryCreatingTaskExecuter.java:51)
           [exec] 	at org.gradle.api.internal.tasks.execution.SkipUpToDateTaskExecuter.execute(SkipUpToDateTaskExecuter.java:59)
           [exec] 	at org.gradle.api.internal.tasks.execution.ResolveTaskOutputCachingStateExecuter.execute(ResolveTaskOutputCachingStateExecuter.java:54)
           [exec] 	at org.gradle.api.internal.tasks.execution.ValidatingTaskExecuter.execute(ValidatingTaskExecuter.java:59)
           [exec] 	at org.gradle.api.internal.tasks.execution.SkipEmptySourceFilesTaskExecuter.execute(SkipEmptySourceFilesTaskExecuter.java:101)
           [exec] 	at org.gradle.api.internal.tasks.execution.FinalizeInputFilePropertiesTaskExecuter.execute(FinalizeInputFilePropertiesTaskExecuter.java:44)
           [exec] 	at org.gradle.api.internal.tasks.execution.CleanupStaleOutputsExecuter.execute(CleanupStaleOutputsExecuter.java:91)
           [exec] 	at org.gradle.api.internal.tasks.execution.ResolveTaskArtifactStateTaskExecuter.execute(ResolveTaskArtifactStateTaskExecuter.java:62)
           [exec] 	at org.gradle.api.internal.tasks.execution.SkipTaskWithNoActionsExecuter.execute(SkipTaskWithNoActionsExecuter.java:59)
           [exec] 	at org.gradle.api.internal.tasks.execution.SkipOnlyIfTaskExecuter.execute(SkipOnlyIfTaskExecuter.java:54)
           [exec] 	at org.gradle.api.internal.tasks.execution.ExecuteAtMostOnceTaskExecuter.execute(ExecuteAtMostOnceTaskExecuter.java:43)
           [exec] 	at org.gradle.api.internal.tasks.execution.CatchExceptionTaskExecuter.execute(CatchExceptionTaskExecuter.java:34)
           [exec] 	at org.gradle.api.internal.tasks.execution.EventFiringTaskExecuter$1.run(EventFiringTaskExecuter.java:51)
           [exec] 	at org.gradle.internal.operations.DefaultBuildOperationExecutor$RunnableBuildOperationWorker.execute(DefaultBuildOperationExecutor.java:300)
           [exec] 	at org.gradle.internal.operations.DefaultBuildOperationExecutor$RunnableBuildOperationWorker.execute(DefaultBuildOperationExecutor.java:292)
           [exec] 	at org.gradle.internal.operations.DefaultBuildOperationExecutor.execute(DefaultBuildOperationExecutor.java:174)
           [exec] 	at org.gradle.internal.operations.DefaultBuildOperationExecutor.run(DefaultBuildOperationExecutor.java:90)
           [exec] 	at org.gradle.internal.operations.DelegatingBuildOperationExecutor.run(DelegatingBuildOperationExecutor.java:31)
           [exec] 	at org.gradle.api.internal.tasks.execution.EventFiringTaskExecuter.execute(EventFiringTaskExecuter.java:46)
           [exec] 	at org.gradle.execution.taskgraph.LocalTaskInfoExecutor.execute(LocalTaskInfoExecutor.java:42)
           [exec] 	at org.gradle.execution.taskgraph.DefaultTaskExecutionGraph$BuildOperationAwareWorkItemExecutor.execute(DefaultTaskExecutionGraph.java:277)
           [exec] 	at org.gradle.execution.taskgraph.DefaultTaskExecutionGraph$BuildOperationAwareWorkItemExecutor.execute(DefaultTaskExecutionGraph.java:262)
           [exec] 	at org.gradle.execution.taskgraph.DefaultTaskPlanExecutor$ExecutorWorker$1.execute(DefaultTaskPlanExecutor.java:135)
           [exec] 	at org.gradle.execution.taskgraph.DefaultTaskPlanExecutor$ExecutorWorker$1.execute(DefaultTaskPlanExecutor.java:130)
           [exec] 	at org.gradle.execution.taskgraph.DefaultTaskPlanExecutor$ExecutorWorker.execute(DefaultTaskPlanExecutor.java:200)
           [exec] 	at org.gradle.execution.taskgraph.DefaultTaskPlanExecutor$ExecutorWorker.executeWithWork(DefaultTaskPlanExecutor.java:191)
           [exec] 	at org.gradle.execution.taskgraph.DefaultTaskPlanExecutor$ExecutorWorker.run(DefaultTaskPlanExecutor.java:130)
           [exec] 	at org.gradle.internal.concurrent.ExecutorPolicy$CatchAndRecordFailures.onExecute(ExecutorPolicy.java:63)
           [exec] 	at org.gradle.internal.concurrent.ManagedExecutorImpl$1.run(ManagedExecutorImpl.java:46)
           [exec] 	at org.gradle.internal.concurrent.ThreadFactoryImpl$ManagedThreadRunnable.run(ThreadFactoryImpl.java:55)
           [exec] Caused by: org.gradle.api.internal.tasks.compile.CompilationFailedException: Compilation failed; see the compiler error output for details.
           [exec] 	at org.gradle.api.internal.tasks.compile.JdkJavaCompiler.execute(JdkJavaCompiler.java:52)
           [exec] 	at org.gradle.api.internal.tasks.compile.JdkJavaCompiler.execute(JdkJavaCompiler.java:36)
           [exec] 	at org.gradle.api.internal.tasks.compile.NormalizingJavaCompiler.delegateAndHandleErrors(NormalizingJavaCompiler.java:100)
           [exec] 	at org.gradle.api.internal.tasks.compile.NormalizingJavaCompiler.execute(NormalizingJavaCompiler.java:52)
           [exec] 	at org.gradle.api.internal.tasks.compile.NormalizingJavaCompiler.execute(NormalizingJavaCompiler.java:38)
           [exec] 	at org.gradle.api.internal.tasks.compile.AnnotationProcessorDiscoveringCompiler.execute(AnnotationProcessorDiscoveringCompiler.java:49)
           [exec] 	at org.gradle.api.internal.tasks.compile.AnnotationProcessorDiscoveringCompiler.execute(AnnotationProcessorDiscoveringCompiler.java:35)
           [exec] 	at org.gradle.api.internal.tasks.compile.CleaningJavaCompilerSupport.execute(CleaningJavaCompilerSupport.java:39)
           [exec] 	at org.gradle.api.internal.tasks.compile.incremental.IncrementalCompilerFactory$2.execute(IncrementalCompilerFactory.java:110)
           [exec] 	at org.gradle.api.internal.tasks.compile.incremental.IncrementalCompilerFactory$2.execute(IncrementalCompilerFactory.java:106)
           [exec] 	at org.gradle.api.internal.tasks.compile.incremental.IncrementalResultStoringCompiler.execute(IncrementalResultStoringCompiler.java:59)
           [exec] 	at org.gradle.api.internal.tasks.compile.incremental.IncrementalResultStoringCompiler.execute(IncrementalResultStoringCompiler.java:43)
           [exec] 	at org.gradle.api.tasks.compile.JavaCompile.performCompilation(JavaCompile.java:153)
           [exec] 	at org.gradle.api.tasks.compile.JavaCompile.compile(JavaCompile.java:121)
           [exec] 	at org.gradle.internal.reflect.JavaMethod.invoke(JavaMethod.java:73)
           [exec] 	at org.gradle.api.internal.project.taskfactory.IncrementalTaskAction.doExecute(IncrementalTaskAction.java:50)
           [exec] 	at org.gradle.api.internal.project.taskfactory.StandardTaskAction.execute(StandardTaskAction.java:39)
           [exec] 	at org.gradle.api.internal.project.taskfactory.StandardTaskAction.execute(StandardTaskAction.java:26)
           [exec] 	at org.gradle.api.internal.tasks.execution.ExecuteActionsTaskExecuter$1.run(ExecuteActionsTaskExecuter.java:131)
           [exec] 	at org.gradle.internal.operations.DefaultBuildOperationExecutor$RunnableBuildOperationWorker.execute(DefaultBuildOperationExecutor.java:300)
           [exec] 	at org.gradle.internal.operations.DefaultBuildOperationExecutor$RunnableBuildOperationWorker.execute(DefaultBuildOperationExecutor.java:292)
           [exec] 	at org.gradle.internal.operations.DefaultBuildOperationExecutor.execute(DefaultBuildOperationExecutor.java:174)
           [exec] 	at org.gradle.internal.operations.DefaultBuildOperationExecutor.run(DefaultBuildOperationExecutor.java:90)
           [exec] 	at org.gradle.internal.operations.DelegatingBuildOperationExecutor.run(DelegatingBuildOperationExecutor.java:31)
           [exec] 	at org.gradle.api.internal.tasks.execution.ExecuteActionsTaskExecuter.executeAction(ExecuteActionsTaskExecuter.java:120)
           [exec] 	at org.gradle.api.internal.tasks.execution.ExecuteActionsTaskExecuter.executeActions(ExecuteActionsTaskExecuter.java:99)
           [exec] 	... 31 more
           [exec] 
           [exec] 
           [exec] * Get more help at https://help.gradle.org
           [exec] 
           [exec] BUILD FAILED in 1m 11s
          [exec] /opt/dev/projects/github/liferay-portal-7.2.x-private/modules/apps/journal/journal-test/src/testIntegration/java/com/liferay/journal/change/tracking/test/JournalCTDefinitionTest.java:72: error: cannot find symbol
           [exec] 		Optional<CTDefinition<?, ?>> ctConfigurationOptional =
           [exec] 		         ^
           [exec]   symbol:   class CTDefinition
           [exec]   location: class JournalCTDefinitionTest
           [exec] /opt/dev/projects/github/liferay-portal-7.2.x-private/modules/apps/journal/journal-test/src/testIntegration/java/com/liferay/journal/change/tracking/test/JournalCTDefinitionTest.java:81: error: cannot find symbol
           [exec] 				CTDefinition::getResourceEntityByResourceEntityIdFunction
           [exec] 				^
           [exec]   symbol:   variable CTDefinition
           [exec]   location: class JournalCTDefinitionTest
           [exec] /opt/dev/projects/github/liferay-portal-7.2.x-private/modules/apps/journal/journal-test/src/testIntegration/java/com/liferay/journal/change/tracking/test/JournalCTDefinitionTest.java:100: error: cannot find symbol
           [exec] 				CTDefinition::getResourceEntityClass
           [exec] 				^
           [exec]   symbol:   variable CTDefinition
           [exec]   location: class JournalCTDefinitionTest
           [exec] /opt/dev/projects/github/liferay-portal-7.2.x-private/modules/apps/journal/journal-test/src/testIntegration/java/com/liferay/journal/change/tracking/test/JournalCTDefinitionTest.java:110: error: cannot find symbol
           [exec] 			CTDefinition::getResourceEntityIdFromResourceEntityFunction
           [exec] 			^
           [exec]   symbol:   variable CTDefinition
           [exec]   location: class JournalCTDefinitionTest
           [exec] /opt/dev/projects/github/liferay-portal-7.2.x-private/modules/apps/journal/journal-test/src/testIntegration/java/com/liferay/journal/change/tracking/test/JournalCTDefinitionTest.java:128: error: cannot find symbol
           [exec] 			CTDefinition::getResourceEntityIdFromVersionEntityFunction
           [exec] 			^
           [exec]   symbol:   variable CTDefinition
           [exec]   location: class JournalCTDefinitionTest
           [exec] /opt/dev/projects/github/liferay-portal-7.2.x-private/modules/apps/journal/journal-test/src/testIntegration/java/com/liferay/journal/change/tracking/test/JournalCTDefinitionTest.java:146: error: cannot find symbol
           [exec] 				CTDefinition::getVersionEntityByVersionEntityIdFunction
           [exec] 				^
           [exec]   symbol:   variable CTDefinition
           [exec]   location: class JournalCTDefinitionTest
           [exec] /opt/dev/projects/github/liferay-portal-7.2.x-private/modules/apps/journal/journal-test/src/testIntegration/java/com/liferay/journal/change/tracking/test/JournalCTDefinitionTest.java:165: error: cannot find symbol
           [exec] 				CTDefinition::getVersionEntityClass
           [exec] 				^
           [exec]   symbol:   variable CTDefinition
           [exec]   location: class JournalCTDefinitionTest
           [exec] /opt/dev/projects/github/liferay-portal-7.2.x-private/modules/apps/journal/journal-test/src/testIntegration/java/com/liferay/journal/change/tracking/test/JournalCTDefinitionTest.java:175: error: cannot find symbol
           [exec] 			CTDefinition::getVersionEntityIdFromResourceEntityFunction
           [exec] 			^
           [exec]   symbol:   variable CTDefinition
           [exec]   location: class JournalCTDefinitionTest
           [exec] /opt/dev/projects/github/liferay-portal-7.2.x-private/modules/apps/journal/journal-test/src/testIntegration/java/com/liferay/journal/change/tracking/test/JournalCTDefinitionTest.java:193: error: cannot find symbol
           [exec] 			CTDefinition::getVersionEntityIdFromVersionEntityFunction
           [exec] 			^
           [exec]   symbol:   variable CTDefinition
           [exec]   location: class JournalCTDefinitionTest
           [exec] /opt/dev/projects/github/liferay-portal-7.2.x-private/modules/apps/journal/journal-test/src/testIntegration/java/com/liferay/journal/change/tracking/test/JournalCTDefinitionTest.java:210: error: cannot find symbol
           [exec] 			CTDefinition::getVersionEntityStatusFunction
           [exec] 			^
           [exec]   symbol:   variable CTDefinition
           [exec]   location: class JournalCTDefinitionTest
      

        Attachments

          Issue Links

            Activity

              People

              • Assignee:
                brooke.dalton Brooke Dalton
                Reporter:
                brooke.dalton Brooke Dalton
                Participants of an Issue:
                Recent user:
                Jason Pince
              • Votes:
                0 Vote for this issue
                Watchers:
                0 Start watching this issue

                Dates

                • Created:
                  Updated:
                  Resolved:
                  Days since last comment:
                  14 weeks, 5 days ago

                  Packages

                  Version Package
                  7.2.X
                  7.2.1 CE GA2