Details

    • Type: Regression Bug
    • Status: Closed
    • Resolution: Completed
    • Affects Version/s: 7.2.X
    • Fix Version/s: None
    • Component/s: Calendar
    • Labels:

      Description

      [exec] FAILURE: Build failed with an exception.
           [exec] 
           [exec] * Where:
           [exec] Build file '/opt/dev/projects/github/liferay-portal-7.2.x/modules/apps/calendar/calendar-web-test/build.gradle' line: 4
           [exec] 
           [exec] * What went wrong:
           [exec] A problem occurred evaluating project ':apps:calendar:calendar-web-test'.
           [exec] > Project with path ':test:arquillian-extension-junit-bridge' could not be found in project ':apps:calendar:calendar-web-test'.
           [exec] 
           [exec] * Try:
           [exec] Run with --info or --debug option to get more log output. Run with --scan to get full insights.
           [exec] 
           [exec] * Exception is:
           [exec] org.gradle.api.GradleScriptException: A problem occurred evaluating project ':apps:calendar:calendar-web-test'.
      
      [exec] Caused by: org.gradle.api.UnknownProjectException: Project with path ':test:arquillian-extension-junit-bridge' could not be found in project ':apps:calendar:calendar-web-test'.
      

      Full Console Log:
      https://test-1-21.liferay.com/job/test-portal-testsuite-upstream(7.2.x)/51/console

        Attachments

          Activity

            People

            Assignee:
            randolph.do Randolph Do (Inactive)
            Reporter:
            randolph.do Randolph Do (Inactive)
            Participants of an Issue:
            Recent user:
            Brian Lee
            Votes:
            0 Vote for this issue
            Watchers:
            0 Start watching this issue

              Dates

              Created:
              Updated:
              Resolved:
              Days since last comment:
              2 years, 6 weeks, 3 days ago

                Packages

                Version Package