Uploaded image for project: 'PUBLIC - Liferay Portal Community Edition'
  1. PUBLIC - Liferay Portal Community Edition
  2. LPS-100709

Stable Job Failure Master/7.2.x - Compile

    Details

    • Type: Regression Bug
    • Status: Closed
    • Resolution: Completed
    • Affects Version/s: 7.2.X, Master
    • Fix Version/s: None
    • Component/s: Sync Connector
    • Labels:

      Description

       [exec] Exception in thread "main" java.lang.RuntimeException: java.lang.reflect.InvocationTargetException
           [exec] 	at com.liferay.jasper.jspc.JspC.main(JspC.java:52)
           [exec] Caused by: java.lang.reflect.InvocationTargetException
           [exec] 	at sun.reflect.NativeMethodAccessorImpl.invoke0(Native Method)
           [exec] 	at sun.reflect.NativeMethodAccessorImpl.invoke(NativeMethodAccessorImpl.java:62)
           [exec] 	at sun.reflect.DelegatingMethodAccessorImpl.invoke(DelegatingMethodAccessorImpl.java:43)
           [exec] 	at java.lang.reflect.Method.invoke(Method.java:498)
           [exec] 	at com.liferay.jasper.jspc.JspC._runWithClassPath(JspC.java:168)
           [exec] 	at com.liferay.jasper.jspc.JspC.main(JspC.java:46)
           [exec] Caused by: org.apache.jasper.JasperException: file:/opt/dev/projects/github/liferay-portal/modules/apps/sync/sync-web/classes/META-INF/resources/sites.jsp(69,2) PWC6131: Attribute markupView invalid for tag management-bar-button according to TLD
           [exec] 	at org.apache.jasper.compiler.DefaultErrorHandler.jspError(DefaultErrorHandler.java:81)
           [exec] 	at org.apache.jasper.compiler.ErrorDispatcher.dispatch(ErrorDispatcher.java:376)
           [exec] 	at org.apache.jasper.compiler.ErrorDispatcher.jspError(ErrorDispatcher.java:204)
           [exec] 	at org.apache.jasper.compiler.Validator$ValidateVisitor.checkXmlAttributes(Validator.java:1223)
           [exec] 	at org.apache.jasper.compiler.Validator$ValidateVisitor.visit(Validator.java:859)
           [exec] 	at org.apache.jasper.compiler.Node$CustomTag.accept(Node.java:1502)
           [exec] 	at org.apache.jasper.compiler.Node$Nodes.visit(Node.java:2297)
           [exec] 	at org.apache.jasper.compiler.Node$Visitor.visitBody(Node.java:2347)
           [exec] 	at org.apache.jasper.compiler.Validator$ValidateVisitor.visit(Validator.java:879)
           [exec] 	at org.apache.jasper.compiler.Node$CustomTag.accept(Node.java:1502)
           [exec] 	at org.apache.jasper.compiler.Node$Nodes.visit(Node.java:2297)
           [exec] 	at org.apache.jasper.compiler.Node$Visitor.visitBody(Node.java:2347)
           [exec] 	at org.apache.jasper.compiler.Validator$ValidateVisitor.visit(Validator.java:879)
           [exec] 	at org.apache.jasper.compiler.Node$CustomTag.accept(Node.java:1502)
           [exec] 	at org.apache.jasper.compiler.Node$Nodes.visit(Node.java:2297)
           [exec] 	at org.apache.jasper.compiler.Node$Visitor.visitBody(Node.java:2347)
           [exec] 	at org.apache.jasper.compiler.Node$Visitor.visit(Node.java:2353)
           [exec] 	at org.apache.jasper.compiler.Node$Root.accept(Node.java:499)
           [exec] 	at org.apache.jasper.compiler.Node$Nodes.visit(Node.java:2297)
           [exec] 	at org.apache.jasper.compiler.Validator.validate(Validator.java:1890)
           [exec] 	at org.apache.jasper.compiler.Compiler.generateJava(Compiler.java:223)
           [exec] 	at org.apache.jasper.compiler.Compiler.compile(Compiler.java:451)
           [exec] 	at org.apache.jasper.JspC.processFile(JspC.java:1178)
           [exec] 	at org.apache.jasper.JspC.execute(JspC.java:1345)
           [exec] 	... 6 more
      
           [exec] > Task :apps:sync:sync-web:generateJSPJava FAILED
           [exec] Compiling JSP files of project ':apps:sync:sync-web' with /opt/dev/projects/github/liferay-portal/bundles/tomcat-9.0.17/webapps/ROOT/WEB-INF/lib/util-taglib.jar as dependency in place of 'com.liferay.portal:com.liferay.util.taglib'
           [exec] 
           [exec] > Task :apps:sync:sync-service:autoUpdateXml SKIPPED
           [exec] > Task :apps:sync:sync-service:jar
           [exec] 
           [exec] > Task :apps:tasks:tasks-portlet:deploy
           [exec] [ant:javac] Note: Some input files use or override a deprecated API.
           [exec] [ant:javac] Note: Recompile with -Xlint:deprecation for details.
           [exec] [ant:javac] Note: Some input files use unchecked or unsafe operations.
           [exec] [ant:javac] Note: Recompile with -Xlint:unchecked for details.
           [exec] 
           [exec] > Task :apps:staging:staging-processes-web:generateJSPJava
           [exec] Compiling JSP files of project ':apps:staging:staging-processes-web' with /opt/dev/projects/github/liferay-portal/bundles/tomcat-9.0.17/webapps/ROOT/WEB-INF/lib/util-taglib.jar as dependency in place of 'com.liferay.portal:com.liferay.util.taglib'
           [exec] 
           [exec] FAILURE: Build failed with an exception.
           [exec] 
           [exec] * What went wrong:
           [exec] Execution failed for task ':apps:sync:sync-web:generateJSPJava'.
           [exec] > Process 'command '/opt/java/jdk1.8.0_121-x64/bin/java'' finished with non-zero exit value 1
           [exec] 
           [exec] * Try:
           [exec] Run with --info or --debug option to get more log output. Run with --scan to get full insights.
           [exec] 
           [exec] * Exception is:
           [exec] org.gradle.api.tasks.TaskExecutionException: Execution failed for task ':apps:sync:sync-web:generateJSPJava'.
           [exec] 	at org.gradle.api.internal.tasks.execution.ExecuteActionsTaskExecuter.executeActions(ExecuteActionsTaskExecuter.java:110)
           [exec] 	at org.gradle.api.internal.tasks.execution.ExecuteActionsTaskExecuter.execute(ExecuteActionsTaskExecuter.java:77)
           [exec] 	at org.gradle.api.internal.tasks.execution.OutputDirectoryCreatingTaskExecuter.execute(OutputDirectoryCreatingTaskExecuter.java:51)
           [exec] 	at org.gradle.api.internal.tasks.execution.SkipUpToDateTaskExecuter.execute(SkipUpToDateTaskExecuter.java:59)
           [exec] 	at org.gradle.api.internal.tasks.execution.ResolveTaskOutputCachingStateExecuter.execute(ResolveTaskOutputCachingStateExecuter.java:54)
           [exec] 	at org.gradle.api.internal.tasks.execution.ValidatingTaskExecuter.execute(ValidatingTaskExecuter.java:59)
           [exec] 	at org.gradle.api.internal.tasks.execution.SkipEmptySourceFilesTaskExecuter.execute(SkipEmptySourceFilesTaskExecuter.java:101)
           [exec] 	at org.gradle.api.internal.tasks.execution.FinalizeInputFilePropertiesTaskExecuter.execute(FinalizeInputFilePropertiesTaskExecuter.java:44)
           [exec] 	at org.gradle.api.internal.tasks.execution.CleanupStaleOutputsExecuter.execute(CleanupStaleOutputsExecuter.java:91)
           [exec] 	at org.gradle.api.internal.tasks.execution.ResolveTaskArtifactStateTaskExecuter.execute(ResolveTaskArtifactStateTaskExecuter.java:62)
           [exec] 	at org.gradle.api.internal.tasks.execution.SkipTaskWithNoActionsExecuter.execute(SkipTaskWithNoActionsExecuter.java:59)
           [exec] 	at org.gradle.api.internal.tasks.execution.SkipOnlyIfTaskExecuter.execute(SkipOnlyIfTaskExecuter.java:54)
           [exec] 	at org.gradle.api.internal.tasks.execution.ExecuteAtMostOnceTaskExecuter.execute(ExecuteAtMostOnceTaskExecuter.java:43)
           [exec] 	at org.gradle.api.internal.tasks.execution.CatchExceptionTaskExecuter.execute(CatchExceptionTaskExecuter.java:34)
           [exec] 	at org.gradle.api.internal.tasks.execution.EventFiringTaskExecuter$1.run(EventFiringTaskExecuter.java:51)
           [exec] 	at org.gradle.internal.operations.DefaultBuildOperationExecutor$RunnableBuildOperationWorker.execute(DefaultBuildOperationExecutor.java:300)
           [exec] 	at org.gradle.internal.operations.DefaultBuildOperationExecutor$RunnableBuildOperationWorker.execute(DefaultBuildOperationExecutor.java:292)
           [exec] 	at org.gradle.internal.operations.DefaultBuildOperationExecutor.execute(DefaultBuildOperationExecutor.java:174)
           [exec] 	at org.gradle.internal.operations.DefaultBuildOperationExecutor.run(DefaultBuildOperationExecutor.java:90)
           [exec] 	at org.gradle.internal.operations.DelegatingBuildOperationExecutor.run(DelegatingBuildOperationExecutor.java:31)
           [exec] 	at org.gradle.api.internal.tasks.execution.EventFiringTaskExecuter.execute(EventFiringTaskExecuter.java:46)
           [exec] 	at org.gradle.execution.taskgraph.LocalTaskInfoExecutor.execute(LocalTaskInfoExecutor.java:42)
           [exec] 	at org.gradle.execution.taskgraph.DefaultTaskExecutionGraph$BuildOperationAwareWorkItemExecutor.execute(DefaultTaskExecutionGraph.java:277)
           [exec] 	at org.gradle.execution.taskgraph.DefaultTaskExecutionGraph$BuildOperationAwareWorkItemExecutor.execute(DefaultTaskExecutionGraph.java:262)
           [exec] 	at org.gradle.execution.taskgraph.DefaultTaskPlanExecutor$ExecutorWorker$1.execute(DefaultTaskPlanExecutor.java:135)
           [exec] 	at org.gradle.execution.taskgraph.DefaultTaskPlanExecutor$ExecutorWorker$1.execute(DefaultTaskPlanExecutor.java:130)
           [exec] 	at org.gradle.execution.taskgraph.DefaultTaskPlanExecutor$ExecutorWorker.execute(DefaultTaskPlanExecutor.java:200)
           [exec] 	at org.gradle.execution.taskgraph.DefaultTaskPlanExecutor$ExecutorWorker.executeWithWork(DefaultTaskPlanExecutor.java:191)
           [exec] 	at org.gradle.execution.taskgraph.DefaultTaskPlanExecutor$ExecutorWorker.run(DefaultTaskPlanExecutor.java:130)
           [exec] 	at org.gradle.internal.concurrent.ExecutorPolicy$CatchAndRecordFailures.onExecute(ExecutorPolicy.java:63)
           [exec] 	at org.gradle.internal.concurrent.ManagedExecutorImpl$1.run(ManagedExecutorImpl.java:46)
           [exec] 	at org.gradle.internal.concurrent.ThreadFactoryImpl$ManagedThreadRunnable.run(ThreadFactoryImpl.java:55)
           [exec] Caused by: org.gradle.process.internal.ExecException: Process 'command '/opt/java/jdk1.8.0_121-x64/bin/java'' finished with non-zero exit value 1
           [exec] 	at org.gradle.process.internal.DefaultExecHandle$ExecResultImpl.assertNormalExitValue(DefaultExecHandle.java:395)
           [exec] 	at org.gradle.process.internal.DefaultJavaExecAction.execute(DefaultJavaExecAction.java:37)
           [exec] 	at org.gradle.api.tasks.JavaExec.exec(JavaExec.java:79)
           [exec] 	at com.liferay.gradle.plugins.jasper.jspc.CompileJSPTask.exec(CompileJSPTask.java:70)
           [exec] 	at org.gradle.internal.reflect.JavaMethod.invoke(JavaMethod.java:73)
           [exec] 	at org.gradle.api.internal.project.taskfactory.StandardTaskAction.doExecute(StandardTaskAction.java:46)
           [exec] 	at org.gradle.api.internal.project.taskfactory.StandardTaskAction.execute(StandardTaskAction.java:39)
           [exec] 	at org.gradle.api.internal.project.taskfactory.StandardTaskAction.execute(StandardTaskAction.java:26)
           [exec] 	at org.gradle.api.internal.AbstractTask$TaskActionWrapper.execute(AbstractTask.java:801)
           [exec] 	at org.gradle.api.internal.AbstractTask$TaskActionWrapper.execute(AbstractTask.java:768)
           [exec] 	at org.gradle.api.internal.tasks.execution.ExecuteActionsTaskExecuter$1.run(ExecuteActionsTaskExecuter.java:131)
           [exec] 	at org.gradle.internal.operations.DefaultBuildOperationExecutor$RunnableBuildOperationWorker.execute(DefaultBuildOperationExecutor.java:300)
           [exec] 	at org.gradle.internal.operations.DefaultBuildOperationExecutor$RunnableBuildOperationWorker.execute(DefaultBuildOperationExecutor.java:292)
           [exec] 	at org.gradle.internal.operations.DefaultBuildOperationExecutor.execute(DefaultBuildOperationExecutor.java:174)
           [exec] 	at org.gradle.internal.operations.DefaultBuildOperationExecutor.run(DefaultBuildOperationExecutor.java:90)
           [exec] 	at org.gradle.internal.operations.DelegatingBuildOperationExecutor.run(DelegatingBuildOperationExecutor.java:31)
           [exec] 	at org.gradle.api.internal.tasks.execution.ExecuteActionsTaskExecuter.executeAction(ExecuteActionsTaskExecuter.java:120)
           [exec] 	at org.gradle.api.internal.tasks.execution.ExecuteActionsTaskExecuter.executeActions(ExecuteActionsTaskExecuter.java:99)
           [exec] 	... 31 more
      

        Attachments

          Activity

            People

            Assignee:
            randolph.do Randolph Do (Inactive)
            Reporter:
            randolph.do Randolph Do (Inactive)
            Participants of an Issue:
            Recent user:
            Brian Lee
            Votes:
            0 Vote for this issue
            Watchers:
            0 Start watching this issue

              Dates

              Created:
              Updated:
              Resolved:
              Days since last comment:
              1 year, 28 weeks, 1 day ago

                Packages

                Version Package