Uploaded image for project: 'PUBLIC - Liferay Portal Community Edition'
  1. PUBLIC - Liferay Portal Community Edition
  2. LPS-103021

LibraryReferenceTest failing due to missing reference

    Details

      Description

      LibraryReferenceTest is failing in 7.2.x-private, 7.2.x, and master with:

          [junit] Testcase: testLibJarsInEclipse(com.liferay.portal.library.LibraryReferenceTest):	FAILED
          [junit] .classpath is missing a reference to lib/portal/ant-compress.jar
          [junit] junit.framework.AssertionFailedError: .classpath is missing a reference to lib/portal/ant-compress.jar
          [junit] 	at com.liferay.portal.library.LibraryReferenceTest.testMissingJarReferences(LibraryReferenceTest.java:231)
          [junit] 	at com.liferay.portal.library.LibraryReferenceTest.testLibJarsInEclipse(LibraryReferenceTest.java:147)
          [junit] 
          [junit] 
          [junit] Testcase: testLibDependencyJarsInVersionsExt(com.liferay.portal.library.LibraryReferenceTest):	FAILED
          [junit] lib/versions-ext.xml is missing a reference to lib/portal/ant-compress.jar
          [junit] junit.framework.AssertionFailedError: lib/versions-ext.xml is missing a reference to lib/portal/ant-compress.jar
          [junit] 	at com.liferay.portal.library.LibraryReferenceTest.testLibDependencyJarsInVersionsExt(LibraryReferenceTest.java:139)
          [junit] 
          [junit] 
          [junit] Testcase: testLibJarsInNetBeans(com.liferay.portal.library.LibraryReferenceTest):	FAILED
          [junit] nbproject/project.properties is missing a reference to lib/portal/ant-compress.jar
          [junit] junit.framework.AssertionFailedError: nbproject/project.properties is missing a reference to lib/portal/ant-compress.jar
          [junit] 	at com.liferay.portal.library.LibraryReferenceTest.testMissingJarReferences(LibraryReferenceTest.java:231)
          [junit] 	at com.liferay.portal.library.LibraryReferenceTest.testLibJarsInNetBeans(LibraryReferenceTest.java:152)
          [junit] 
          [junit] 
          [junit] Test com.liferay.portal.library.LibraryReferenceTest FAILED
      

        Attachments

          Issue Links

            Activity

              People

              • Assignee:
                brooke.dalton Brooke Dalton
                Reporter:
                brooke.dalton Brooke Dalton
                Participants of an Issue:
                Recent user:
                Brian Wulbern
              • Votes:
                0 Vote for this issue
                Watchers:
                0 Start watching this issue

                Dates

                • Created:
                  Updated:
                  Resolved:
                  Days since last comment:
                  6 weeks ago

                  Packages

                  Version Package
                  Master