Uploaded image for project: 'PUBLIC - Liferay Portal Community Edition'
  1. PUBLIC - Liferay Portal Community Edition
  2. LPS-103494

Investigate: java.lang.Exception: Element is not visible in WorkflowadminCPWebcontent

    Details

    • Type: Regression Bug
    • Status: Open
    • Resolution: Unresolved
    • Affects Version/s: Master
    • Fix Version/s: None
    • Component/s: Workflow

      Description

           [exec]     LIFERAY_ERROR: (http://localhost:8080/group/guest/~/control_panel/manage:504): Parse error. '}' expected [JSC_PARSE_ERROR]
           [exec] 
           [exec]     BUILD FAILED: Element is not visible at "//select[contains(@id,'workflowDefinition-1')]"
           [exec]     /opt/dev/projects/github/liferay-portal/portal-web/test/functional/com/liferay/portalweb/macros/journal/WebContentFolder.macro[configureWorkflowCP]:124
           [exec]     /opt/dev/projects/github/liferay-portal/portal-web/test/functional/com/liferay/portalweb/tests/enduser/workflow/workflowadmin/WorkflowadminCPWebcontent.testcase[ApproveInWCSubfolderWorkflow]:85
           [exec] 
           [exec] 
           [exec] com.liferay.poshi.runner.PoshiRunner > test[LocalFile.WorkflowadminCPWebcontent#ApproveInWCSubfolderWorkflow] STANDARD_ERROR
           [exec]     java.lang.Exception: Element is not visible at "//select[contains(@id,'workflowDefinition-1')]"
           [exec]     	at com.liferay.poshi.runner.selenium.BaseWebDriverImpl$Condition.assertTrue(BaseWebDriverImpl.java:4449)
           [exec]     	at com.liferay.poshi.runner.selenium.BaseWebDriverImpl$Condition.waitFor(BaseWebDriverImpl.java:4482)
           [exec]     	at com.liferay.poshi.runner.selenium.BaseWebDriverImpl$Condition.waitFor(BaseWebDriverImpl.java:4463)
           [exec]     	at com.liferay.poshi.runner.selenium.BaseWebDriverImpl.waitForVisible(BaseWebDriverImpl.java:3402)
           [exec]     	at sun.reflect.GeneratedMethodAccessor7.invoke(Unknown Source)
           [exec]     	at sun.reflect.DelegatingMethodAccessorImpl.invoke(DelegatingMethodAccessorImpl.java:43)
           [exec]     	at java.lang.reflect.Method.invoke(Method.java:498)
           [exec]     	at com.liferay.poshi.runner.PoshiRunnerExecutor$1.call(PoshiRunnerExecutor.java:1195)
           [exec]     	at java.util.concurrent.FutureTask.run(FutureTask.java:266)
           [exec]     	at java.util.concurrent.ThreadPoolExecutor.runWorker(ThreadPoolExecutor.java:1142)
           [exec]     	at java.util.concurrent.ThreadPoolExecutor$Worker.run(ThreadPoolExecutor.java:617)
           [exec]     	at java.lang.Thread.run(Thread.java:745)
      

        Attachments

          Activity

            People

            • Assignee:
              support-lep@liferay.com SE Support
              Reporter:
              kristin.onias Kristin Onias
              Participants of an Issue:
              Recent user:
              Brian Wulbern
            • Votes:
              0 Vote for this issue
              Watchers:
              0 Start watching this issue

              Dates

              • Created:
                Updated:
                Days since last comment:
                6 weeks, 6 days ago

                Packages

                Version Package