Uploaded image for project: 'PUBLIC - Liferay Portal Community Edition'
  1. PUBLIC - Liferay Portal Community Edition
  2. LPS-103606

Failed to apply plugin [id 'com.liferay.defaults.plugin']

    Details

    • Fix Priority:
      3

      Description

      This issue is found on 7.2.x-private Acceptance CI tester.

      for semantic-versioning-jdk8 batch:

      [exec] FAILURE: Build failed with an exception.
       [exec] 
       [exec] * Where:
       [exec] Build file '/opt/dev/projects/github/liferay-portal-7.2.x/modules/build.gradle' line: 104
       [exec] 
       [exec] * What went wrong:
       [exec] A problem occurred configuring project ':dxp:apps:document-library-opener:document-library-opener-onedrive-test'.
       [exec] > Failed to apply plugin [id 'com.liferay.defaults.plugin']
       [exec] > Please run the following command to setup the build profile for DXP:
       [exec] /opt/dev/projects/github/liferay-portal-7.2.x$ ant setup-profile-dxp
       [exec] 
       [exec] * Try:
       [exec] Run with --info or --debug option to get more log output. Run with --scan to get full insights.
       [exec] 
       [exec] * Exception is:
       [exec] org.gradle.api.ProjectConfigurationException: A problem occurred configuring project ':dxp:apps:document-library-opener:document-library-opener-onedrive-test'.
       [exec] at org.gradle.configuration.project.LifecycleProjectEvaluator.wrapException(LifecycleProjectEvaluator.java:79)
       [exec] at org.gradle.configuration.project.LifecycleProjectEvaluator.addConfigurationFailure(LifecycleProjectEvaluator.java:73)
       [exec] at org.gradle.configuration.project.LifecycleProjectEvaluator.access$400(LifecycleProjectEvaluator.java:54)
       [exec] at org.gradle.configuration.project.LifecycleProjectEvaluator$NotifyBeforeEvaluate.run(LifecycleProjectEvaluator.java:157)
       [exec] at org.gradle.internal.operations.DefaultBuildOperationExecutor$RunnableBuildOperationWorker.execute(DefaultBuildOperationExecutor.java:300)
       [exec] at org.gradle.internal.operations.DefaultBuildOperationExecutor$RunnableBuildOperationWorker.execute(DefaultBuildOperationExecutor.java:292)
       [exec] at org.gradle.internal.operations.DefaultBuildOperationExecutor.execute(DefaultBuildOperationExecutor.java:174)
       [exec] at org.gradle.internal.operations.DefaultBuildOperationExecutor.run(DefaultBuildOperationExecutor.java:90)
       [exec] at org.gradle.internal.operations.DelegatingBuildOperationExecutor.run(DelegatingBuildOperationExecutor.java:31)
       [exec] at org.gradle.configuration.project.LifecycleProjectEvaluator$EvaluateProject.run(LifecycleProjectEvaluator.java:100)
       [exec] at org.gradle.internal.operations.DefaultBuildOperationExecutor$RunnableBuildOperationWorker.execute(DefaultBuildOperationExecutor.java:300)
       [exec] at org.gradle.internal.operations.DefaultBuildOperationExecutor$RunnableBuildOperationWorker.execute(DefaultBuildOperationExecutor.java:292)
       [exec] at org.gradle.internal.operations.DefaultBuildOperationExecutor.execute(DefaultBuildOperationExecutor.java:174)
       [exec] at org.gradle.internal.operations.DefaultBuildOperationExecutor.run(DefaultBuildOperationExecutor.java:90)
       [exec] at org.gradle.internal.operations.DelegatingBuildOperationExecutor.run(DelegatingBuildOperationExecutor.java:31)
       [exec] at org.gradle.configuration.project.LifecycleProjectEvaluator.evaluate(LifecycleProjectEvaluator.java:68)
       [exec] at org.gradle.api.internal.project.DefaultProject.evaluate(DefaultProject.java:687)
       [exec] at org.gradle.api.internal.project.DefaultProject.evaluate(DefaultProject.java:140)
       [exec] at org.gradle.execution.TaskPathProjectEvaluator.configure(TaskPathProjectEvaluator.java:35)
       [exec] at org.gradle.execution.TaskPathProjectEvaluator.configureHierarchy(TaskPathProjectEvaluator.java:62)
       [exec] at org.gradle.execution.TaskSelector.getSelection(TaskSelector.java:100)
       [exec] at org.gradle.execution.TaskSelector.getSelection(TaskSelector.java:81)
       [exec] at org.gradle.execution.commandline.CommandLineTaskParser.parseTasks(CommandLineTaskParser.java:42)
       [exec] at org.gradle.execution.TaskNameResolvingBuildConfigurationAction.configure(TaskNameResolvingBuildConfigurationAction.java:44)
       [exec] at org.gradle.execution.DefaultBuildConfigurationActionExecuter.configure(DefaultBuildConfigurationActionExecuter.java:48)
       [exec] at org.gradle.execution.DefaultBuildConfigurationActionExecuter.access$000(DefaultBuildConfigurationActionExecuter.java:25)
       [exec] at org.gradle.execution.DefaultBuildConfigurationActionExecuter$1.proceed(DefaultBuildConfigurationActionExecuter.java:54)
       [exec] at org.gradle.execution.DefaultTasksBuildExecutionAction.configure(DefaultTasksBuildExecutionAction.java:44)
       [exec] at org.gradle.execution.DefaultBuildConfigurationActionExecuter.configure(DefaultBuildConfigurationActionExecuter.java:48)
       [exec] at org.gradle.execution.DefaultBuildConfigurationActionExecuter.access$000(DefaultBuildConfigurationActionExecuter.java:25)
       [exec] at org.gradle.execution.DefaultBuildConfigurationActionExecuter$1.proceed(DefaultBuildConfigurationActionExecuter.java:54)
       [exec] at org.gradle.execution.ExcludedTaskFilteringBuildConfigurationAction.configure(ExcludedTaskFilteringBuildConfigurationAction.java:47)
       [exec] at org.gradle.execution.DefaultBuildConfigurationActionExecuter.configure(DefaultBuildConfigurationActionExecuter.java:48)
       [exec] at org.gradle.execution.DefaultBuildConfigurationActionExecuter.select(DefaultBuildConfigurationActionExecuter.java:36)
       [exec] at org.gradle.initialization.DefaultGradleLauncher$CalculateTaskGraph.run(DefaultGradleLauncher.java:305)
       [exec] at org.gradle.internal.operations.DefaultBuildOperationExecutor$RunnableBuildOperationWorker.execute(DefaultBuildOperationExecutor.java:300)
       [exec] at org.gradle.internal.operations.DefaultBuildOperationExecutor$RunnableBuildOperationWorker.execute(DefaultBuildOperationExecutor.java:292)
       [exec] at org.gradle.internal.operations.DefaultBuildOperationExecutor.execute(DefaultBuildOperationExecutor.java:174)
       [exec] at org.gradle.internal.operations.DefaultBuildOperationExecutor.run(DefaultBuildOperationExecutor.java:90)
       [exec] at org.gradle.internal.operations.DelegatingBuildOperationExecutor.run(DelegatingBuildOperationExecutor.java:31)
       [exec] at org.gradle.initialization.DefaultGradleLauncher.constructTaskGraph(DefaultGradleLauncher.java:190)
       [exec] at org.gradle.initialization.DefaultGradleLauncher.doBuildStages(DefaultGradleLauncher.java:145)
       [exec] at org.gradle.initialization.DefaultGradleLauncher.executeTasks(DefaultGradleLauncher.java:124)
       [exec] at org.gradle.internal.invocation.GradleBuildController$1.call(GradleBuildController.java:77)
       [exec] at org.gradle.internal.invocation.GradleBuildController$1.call(GradleBuildController.java:74)
       [exec] at org.gradle.internal.work.DefaultWorkerLeaseService.withLocks(DefaultWorkerLeaseService.java:154)
       [exec] at org.gradle.internal.work.StopShieldingWorkerLeaseService.withLocks(StopShieldingWorkerLeaseService.java:38)
       [exec] at org.gradle.internal.invocation.GradleBuildController.doBuild(GradleBuildController.java:96)
       [exec] at org.gradle.internal.invocation.GradleBuildController.run(GradleBuildController.java:74)
       [exec] at org.gradle.tooling.internal.provider.ExecuteBuildActionRunner.run(ExecuteBuildActionRunner.java:28)
       [exec] at org.gradle.launcher.exec.ChainingBuildActionRunner.run(ChainingBuildActionRunner.java:35)
       [exec] at org.gradle.tooling.internal.provider.ValidatingBuildActionRunner.run(ValidatingBuildActionRunner.java:32)
       [exec] at org.gradle.launcher.exec.RunAsBuildOperationBuildActionRunner$3.run(RunAsBuildOperationBuildActionRunner.java:50)
       [exec] at org.gradle.internal.operations.DefaultBuildOperationExecutor$RunnableBuildOperationWorker.execute(DefaultBuildOperationExecutor.java:300)
       [exec] at org.gradle.internal.operations.DefaultBuildOperationExecutor$RunnableBuildOperationWorker.execute(DefaultBuildOperationExecutor.java:292)
       [exec] at org.gradle.internal.operations.DefaultBuildOperationExecutor.execute(DefaultBuildOperationExecutor.java:174)
       [exec] at org.gradle.internal.operations.DefaultBuildOperationExecutor.run(DefaultBuildOperationExecutor.java:90)
       [exec] at org.gradle.internal.operations.DelegatingBuildOperationExecutor.run(DelegatingBuildOperationExecutor.java:31)
       [exec] at org.gradle.launcher.exec.RunAsBuildOperationBuildActionRunner.run(RunAsBuildOperationBuildActionRunner.java:45)
       [exec] at org.gradle.tooling.internal.provider.SubscribableBuildActionRunner.run(SubscribableBuildActionRunner.java:51)
       [exec] at org.gradle.launcher.exec.InProcessBuildActionExecuter$1.transform(InProcessBuildActionExecuter.java:47)
       [exec] at org.gradle.launcher.exec.InProcessBuildActionExecuter$1.transform(InProcessBuildActionExecuter.java:44)
       [exec] at org.gradle.composite.internal.DefaultRootBuildState.run(DefaultRootBuildState.java:79)
       [exec] at org.gradle.launcher.exec.InProcessBuildActionExecuter.execute(InProcessBuildActionExecuter.java:44)
       [exec] at org.gradle.launcher.exec.InProcessBuildActionExecuter.execute(InProcessBuildActionExecuter.java:30)
       [exec] at org.gradle.launcher.exec.BuildTreeScopeBuildActionExecuter.execute(BuildTreeScopeBuildActionExecuter.java:39)
       [exec] at org.gradle.launcher.exec.BuildTreeScopeBuildActionExecuter.execute(BuildTreeScopeBuildActionExecuter.java:25)
       [exec] at org.gradle.tooling.internal.provider.ContinuousBuildActionExecuter.execute(ContinuousBuildActionExecuter.java:80)
       [exec] at org.gradle.tooling.internal.provider.ContinuousBuildActionExecuter.execute(ContinuousBuildActionExecuter.java:53)
       [exec] at org.gradle.tooling.internal.provider.ServicesSetupBuildActionExecuter.execute(ServicesSetupBuildActionExecuter.java:62)
       [exec] at org.gradle.tooling.internal.provider.ServicesSetupBuildActionExecuter.execute(ServicesSetupBuildActionExecuter.java:34)
       [exec] at org.gradle.tooling.internal.provider.GradleThreadBuildActionExecuter.execute(GradleThreadBuildActionExecuter.java:36)
       [exec] at org.gradle.tooling.internal.provider.GradleThreadBuildActionExecuter.execute(GradleThreadBuildActionExecuter.java:25)
       [exec] at org.gradle.tooling.internal.provider.ParallelismConfigurationBuildActionExecuter.execute(ParallelismConfigurationBuildActionExecuter.java:43)
       [exec] at org.gradle.tooling.internal.provider.ParallelismConfigurationBuildActionExecuter.execute(ParallelismConfigurationBuildActionExecuter.java:29)
       [exec] at org.gradle.tooling.internal.provider.StartParamsValidatingActionExecuter.execute(StartParamsValidatingActionExecuter.java:59)
       [exec] at org.gradle.tooling.internal.provider.StartParamsValidatingActionExecuter.execute(StartParamsValidatingActionExecuter.java:31)
       [exec] at org.gradle.tooling.internal.provider.SessionFailureReportingActionExecuter.execute(SessionFailureReportingActionExecuter.java:59)
       [exec] at org.gradle.tooling.internal.provider.SessionFailureReportingActionExecuter.execute(SessionFailureReportingActionExecuter.java:44)
       [exec] at org.gradle.tooling.internal.provider.SetupLoggingActionExecuter.execute(SetupLoggingActionExecuter.java:46)
       [exec] at org.gradle.tooling.internal.provider.SetupLoggingActionExecuter.execute(SetupLoggingActionExecuter.java:30)
       [exec] at org.gradle.launcher.cli.RunBuildAction.run(RunBuildAction.java:52)
       [exec] at org.gradle.internal.Actions$RunnableActionAdapter.execute(Actions.java:207)
       [exec] at org.gradle.launcher.cli.CommandLineActionFactory$ParseAndBuildAction.execute(CommandLineActionFactory.java:402)
       [exec] at org.gradle.launcher.cli.CommandLineActionFactory$ParseAndBuildAction.execute(CommandLineActionFactory.java:375)
       [exec] at org.gradle.launcher.cli.ExceptionReportingAction.execute(ExceptionReportingAction.java:37)
       [exec] at org.gradle.launcher.cli.ExceptionReportingAction.execute(ExceptionReportingAction.java:23)
       [exec] at org.gradle.launcher.cli.CommandLineActionFactory$WithLogging.execute(CommandLineActionFactory.java:368)
       [exec] at org.gradle.launcher.cli.CommandLineActionFactory$WithLogging.execute(CommandLineActionFactory.java:298)
       [exec] at org.gradle.launcher.Main.doAction(Main.java:36)
       [exec] at org.gradle.launcher.bootstrap.EntryPoint.run(EntryPoint.java:45)
       [exec] at org.gradle.launcher.bootstrap.ProcessBootstrap.runNoExit(ProcessBootstrap.java:60)
       [exec] at org.gradle.launcher.bootstrap.ProcessBootstrap.run(ProcessBootstrap.java:37)
       [exec] at org.gradle.launcher.GradleMain.main(GradleMain.java:23)
       [exec] at org.gradle.wrapper.BootstrapMainStarter.start(BootstrapMainStarter.java:31)
       [exec] at org.gradle.wrapper.WrapperExecutor.execute(WrapperExecutor.java:108)
       [exec] at org.gradle.wrapper.GradleWrapperMain.main(GradleWrapperMain.java:61)
       [exec] Caused by: org.gradle.api.internal.plugins.PluginApplicationException: Failed to apply plugin [id 'com.liferay.defaults.plugin']
       [exec] at org.gradle.api.internal.plugins.DefaultPluginManager.doApply(DefaultPluginManager.java:160)
       [exec] at org.gradle.api.internal.plugins.DefaultPluginManager.apply(DefaultPluginManager.java:130)
       [exec] at org.gradle.api.internal.plugins.DefaultObjectConfigurationAction.applyType(DefaultObjectConfigurationAction.java:120)
       [exec] at org.gradle.api.internal.plugins.DefaultObjectConfigurationAction.access$200(DefaultObjectConfigurationAction.java:38)
       [exec] at org.gradle.api.internal.plugins.DefaultObjectConfigurationAction$3.run(DefaultObjectConfigurationAction.java:86)
       [exec] at org.gradle.api.internal.plugins.DefaultObjectConfigurationAction.execute(DefaultObjectConfigurationAction.java:143)
       [exec] at org.gradle.api.internal.project.AbstractPluginAware.apply(AbstractPluginAware.java:46)
       [exec] at org.gradle.internal.metaobject.BeanDynamicObject$MetaClassAdapter.invokeMethod(BeanDynamicObject.java:479)
       [exec] at org.gradle.internal.metaobject.BeanDynamicObject.tryInvokeMethod(BeanDynamicObject.java:191)
       [exec] at org.gradle.internal.metaobject.CompositeDynamicObject.tryInvokeMethod(CompositeDynamicObject.java:98)
       [exec] at org.gradle.internal.metaobject.MixInClosurePropertiesAsMethodsDynamicObject.tryInvokeMethod(MixInClosurePropertiesAsMethodsDynamicObject.java:30)
       [exec] at org.gradle.internal.metaobject.ConfigureDelegate.invokeMethod(ConfigureDelegate.java:57)
       [exec] at build_g9pyvv5bser8jqp4gj4l86yy$_run_closure7$_closure16.doCall(/opt/dev/projects/github/liferay-portal-7.2.x/modules/build.gradle:104)
       [exec] at org.gradle.api.internal.ClosureBackedAction.execute(ClosureBackedAction.java:71)
       [exec] at org.gradle.util.ConfigureUtil.configureTarget(ConfigureUtil.java:155)
       [exec] at org.gradle.util.ConfigureUtil.configure(ConfigureUtil.java:106)
       [exec] at org.gradle.api.internal.project.DefaultProject.configure(DefaultProject.java:1164)
       [exec] at org.gradle.internal.metaobject.BeanDynamicObject$MetaClassAdapter.invokeMethod(BeanDynamicObject.java:479)
       [exec] at org.gradle.internal.metaobject.BeanDynamicObject.tryInvokeMethod(BeanDynamicObject.java:191)
       [exec] at org.gradle.internal.metaobject.CompositeDynamicObject.tryInvokeMethod(CompositeDynamicObject.java:98)
       [exec] at org.gradle.internal.metaobject.MixInClosurePropertiesAsMethodsDynamicObject.tryInvokeMethod(MixInClosurePropertiesAsMethodsDynamicObject.java:30)
       [exec] at org.gradle.groovy.scripts.BasicScript$ScriptDynamicObject.tryInvokeMethod(BasicScript.java:133)
       [exec] at org.gradle.internal.metaobject.AbstractDynamicObject.invokeMethod(AbstractDynamicObject.java:160)
       [exec] at org.gradle.groovy.scripts.BasicScript.invokeMethod(BasicScript.java:82)
       [exec] at build_g9pyvv5bser8jqp4gj4l86yy$_run_closure7.doCall(/opt/dev/projects/github/liferay-portal-7.2.x/modules/build.gradle:103)
       [exec] at org.gradle.configuration.internal.DefaultListenerBuildOperationDecorator$BuildOperationEmittingClosure$1$1.run(DefaultListenerBuildOperationDecorator.java:186)
       [exec] at org.gradle.configuration.internal.DefaultUserCodeApplicationContext.reapply(DefaultUserCodeApplicationContext.java:58)
       [exec] at org.gradle.configuration.internal.DefaultListenerBuildOperationDecorator$BuildOperationEmittingClosure$1.run(DefaultListenerBuildOperationDecorator.java:181)
       [exec] at org.gradle.internal.operations.DefaultBuildOperationExecutor$RunnableBuildOperationWorker.execute(DefaultBuildOperationExecutor.java:300)
       [exec] at org.gradle.internal.operations.DefaultBuildOperationExecutor$RunnableBuildOperationWorker.execute(DefaultBuildOperationExecutor.java:292)
       [exec] at org.gradle.internal.operations.DefaultBuildOperationExecutor.execute(DefaultBuildOperationExecutor.java:174)
       [exec] at org.gradle.internal.operations.DefaultBuildOperationExecutor.run(DefaultBuildOperationExecutor.java:90)
       [exec] at org.gradle.configuration.internal.DefaultListenerBuildOperationDecorator$BuildOperationEmittingClosure.doCall(DefaultListenerBuildOperationDecorator.java:178)
       [exec] at org.gradle.listener.ClosureBackedMethodInvocationDispatch.dispatch(ClosureBackedMethodInvocationDispatch.java:40)
       [exec] at org.gradle.listener.ClosureBackedMethodInvocationDispatch.dispatch(ClosureBackedMethodInvocationDispatch.java:25)
       [exec] at org.gradle.internal.event.AbstractBroadcastDispatch.dispatch(AbstractBroadcastDispatch.java:42)
       [exec] at org.gradle.internal.event.BroadcastDispatch$SingletonDispatch.dispatch(BroadcastDispatch.java:230)
       [exec] at org.gradle.internal.event.BroadcastDispatch$SingletonDispatch.dispatch(BroadcastDispatch.java:149)
       [exec] at org.gradle.internal.event.AbstractBroadcastDispatch.dispatch(AbstractBroadcastDispatch.java:58)
       [exec] at org.gradle.internal.event.BroadcastDispatch$CompositeDispatch.dispatch(BroadcastDispatch.java:324)
       [exec] at org.gradle.internal.event.BroadcastDispatch$CompositeDispatch.dispatch(BroadcastDispatch.java:234)
       [exec] at org.gradle.internal.event.ListenerBroadcast.dispatch(ListenerBroadcast.java:140)
       [exec] at org.gradle.internal.event.ListenerBroadcast.dispatch(ListenerBroadcast.java:37)
       [exec] at org.gradle.internal.dispatch.ProxyDispatchAdapter$DispatchingInvocationHandler.invoke(ProxyDispatchAdapter.java:93)
       [exec] at com.sun.proxy.$Proxy30.beforeEvaluate(Unknown Source)
       [exec] at org.gradle.internal.dispatch.ReflectionDispatch.dispatch(ReflectionDispatch.java:35)
       [exec] at org.gradle.internal.dispatch.ReflectionDispatch.dispatch(ReflectionDispatch.java:24)
       [exec] at org.gradle.internal.event.AbstractBroadcastDispatch.dispatch(AbstractBroadcastDispatch.java:42)
       [exec] at org.gradle.internal.event.BroadcastDispatch$SingletonDispatch.dispatch(BroadcastDispatch.java:230)
       [exec] at org.gradle.internal.event.BroadcastDispatch$SingletonDispatch.dispatch(BroadcastDispatch.java:149)
       [exec] at org.gradle.internal.event.ListenerBroadcast.dispatch(ListenerBroadcast.java:140)
       [exec] at org.gradle.internal.event.ListenerBroadcast.dispatch(ListenerBroadcast.java:37)
       [exec] at org.gradle.internal.dispatch.ProxyDispatchAdapter$DispatchingInvocationHandler.invoke(ProxyDispatchAdapter.java:93)
       [exec] at com.sun.proxy.$Proxy30.beforeEvaluate(Unknown Source)
       [exec] at org.gradle.configuration.project.LifecycleProjectEvaluator$NotifyBeforeEvaluate.run(LifecycleProjectEvaluator.java:154)
       [exec] ... 93 more
       [exec] Caused by: org.gradle.api.GradleException: Please run the following command to setup the build profile for DXP:
       [exec] /opt/dev/projects/github/liferay-portal-7.2.x$ ant setup-profile-dxp
       [exec] at com.liferay.gradle.plugins.defaults.internal.LiferayProfileDXPPlugin.apply(LiferayProfileDXPPlugin.java:54)
       [exec] at com.liferay.gradle.plugins.defaults.internal.LiferayProfileDXPPlugin.apply(LiferayProfileDXPPlugin.java:28)
       [exec] at com.liferay.gradle.plugins.defaults.LiferayDefaultsPlugin.apply(LiferayDefaultsPlugin.java:54)
       [exec] at com.liferay.gradle.plugins.defaults.LiferayDefaultsPlugin.apply(LiferayDefaultsPlugin.java:35)
       [exec] at org.gradle.api.internal.plugins.ImperativeOnlyPluginTarget.applyImperative(ImperativeOnlyPluginTarget.java:42)
       [exec] at org.gradle.api.internal.plugins.RuleBasedPluginTarget.applyImperative(RuleBasedPluginTarget.java:50)
       [exec] at org.gradle.api.internal.plugins.DefaultPluginManager.addPlugin(DefaultPluginManager.java:174)
       [exec] at org.gradle.api.internal.plugins.DefaultPluginManager.access$300(DefaultPluginManager.java:50)
       [exec] at org.gradle.api.internal.plugins.DefaultPluginManager$AddPluginBuildOperation.run(DefaultPluginManager.java:264)
       [exec] at org.gradle.internal.operations.DefaultBuildOperationExecutor$RunnableBuildOperationWorker.execute(DefaultBuildOperationExecutor.java:300)
       [exec] at org.gradle.internal.operations.DefaultBuildOperationExecutor$RunnableBuildOperationWorker.execute(DefaultBuildOperationExecutor.java:292)
       [exec] at org.gradle.internal.operations.DefaultBuildOperationExecutor.execute(DefaultBuildOperationExecutor.java:174)
       [exec] at org.gradle.internal.operations.DefaultBuildOperationExecutor.run(DefaultBuildOperationExecutor.java:90)
       [exec] at org.gradle.internal.operations.DelegatingBuildOperationExecutor.run(DelegatingBuildOperationExecutor.java:31)
       [exec] at org.gradle.api.internal.plugins.DefaultPluginManager$2.execute(DefaultPluginManager.java:152)
       [exec] at org.gradle.api.internal.plugins.DefaultPluginManager$2.execute(DefaultPluginManager.java:149)
       [exec] at org.gradle.configuration.internal.DefaultUserCodeApplicationContext.apply(DefaultUserCodeApplicationContext.java:48)
       [exec] at org.gradle.api.internal.plugins.DefaultPluginManager.doApply(DefaultPluginManager.java:149)
       [exec] ... 147 more

      Full log:

      https://test-1-17.liferay.com/job/test-portal-acceptance-pullrequest-batch(7.2.x)/AXIS_VARIABLE=0,label_exp=!master/3296/consoleFull

        Attachments

          Issue Links

            Activity

              People

              • Assignee:
                della.wang Della Wang
                Reporter:
                della.wang Della Wang
                Participants of an Issue:
                Recent user:
                Della Wang
              • Votes:
                0 Vote for this issue
                Watchers:
                0 Start watching this issue

                Dates

                • Created:
                  Updated:
                  Resolved:
                  Days since last comment:
                  41 weeks, 3 days ago

                  Packages

                  Version Package
                  7.2.X