Uploaded image for project: 'PUBLIC - Liferay Portal Community Edition'
  1. PUBLIC - Liferay Portal Community Edition
  2. LPS-104534

Please Investigate: Build failure in Websphere

    Description

    Build is failing in Websphere environment.

        [retry] Attempt [0]: error occurred; retrying...
         [echo] Retrieving {liferay-portal-source,liferay-portal-bundle-websphere}.* from cloud-10-0-19-51.
         [exec] ssh: connect to host cloud-10-0-19-51 port 22: Connection refused
         [exec] ssh: connect to host cloud-10-0-19-51 port 22: Connection refused
         [exec] rsync: connection unexpectedly closed (0 bytes received so far) [Receiver]
         [exec] rsync error: unexplained error (code 255) at io.c(226) [Receiver=3.1.2]
         [exec] 
         [exec] real	0m0.006s
         [exec] user	0m0.004s
         [exec] sys	0m0.001s
         [exec] rsync: connection unexpectedly closed (0 bytes received so far) [Receiver]
         [exec] rsync error: unexplained error (code 255) at io.c(226) [Receiver=3.1.2]
         [exec] 
         [exec] real	0m0.006s
         [exec] user	0m0.004s
         [exec] sys	0m0.001s
       [delete] Deleting: /opt/dev/projects/github/liferay-jenkins-ee/commands/20191112100415939
        [retry] Attempt [1]: error occurred; retrying...
         [echo] Retrieving {liferay-portal-source,liferay-portal-bundle-websphere}.* from cloud-10-0-110-87.
         [exec] Warning: Permanently added 'cloud-10-0-110-87,10.0.110.87' (ECDSA) to the list of known hosts.
         [exec] Warning: Permanently added 'cloud-10-0-110-87,10.0.110.87' (ECDSA) to the list of known hosts.
         [exec] rsync: link_stat "/tmp/dist/test-1-1/test-portal-acceptance-upstream(7.2.x)/835/dist/liferay-portal-bundle-websphere.*" failed: No such file or directory (2)
         [exec] rsync: link_stat "/tmp/dist/test-1-1/test-portal-acceptance-upstream(7.2.x)/835/dist/liferay-portal-bundle-websphere.*" failed: No such file or directory (2)
         [exec] rsync error: some files/attrs were not transferred (see previous errors) (code 23) at main.c(1650) [generator=3.1.2]
         [exec] 
         [exec] rsync error: some files/attrs were not transferred (see previous errors) (code 23) at main.c(1650) [generator=3.1.2]
         [exec] 
         [exec] real	0m0.727s
         [exec] user	0m0.235s
         [exec] sys	0m0.069s
         [exec] real	0m0.727s
         [exec] user	0m0.235s
         [exec] sys	0m0.069s
       [delete] Deleting: /opt/dev/projects/github/liferay-jenkins-ee/commands/20191112100415962
        [retry] Attempt [2]: error occurred; retrying...
         [echo] Retrieving {liferay-portal-source,liferay-portal-bundle-websphere}.* from cloud-10-0-13-145.
         [exec] Warning: Permanently added 'cloud-10-0-13-145,10.0.13.145' (ECDSA) to the list of known hosts.
         [exec] Warning: Permanently added 'cloud-10-0-13-145,10.0.13.145' (ECDSA) to the list of known hosts.
         [exec] rsync: link_stat "/tmp/dist/test-1-1/test-portal-acceptance-upstream(7.2.x)/835/dist/liferay-portal-bundle-websphere.*" failed: No such file or directory (2)
         [exec] rsync: link_stat "/tmp/dist/test-1-1/test-portal-acceptance-upstream(7.2.x)/835/dist/liferay-portal-bundle-websphere.*" failed: No such file or directory (2)
         [exec] rsync error: some files/attrs were not transferred (see previous errors) (code 23) at main.c(1650) [generator=3.1.2]
         [exec] 
         [exec] rsync error: some files/attrs were not transferred (see previous errors) (code 23) at main.c(1650) [generator=3.1.2]
         [exec] 
         [exec] real	0m0.697s
         [exec] user	0m0.223s
         [exec] sys	0m0.072s
         [exec] real	0m0.697s
         [exec] user	0m0.223s
         [exec] sys	0m0.072s
       [delete] Deleting: /opt/dev/projects/github/liferay-jenkins-ee/commands/20191112100416709
        [retry] Attempt [3]: error occurred; retrying...
         [echo] Retrieving {liferay-portal-source,liferay-portal-bundle-websphere}.* from cloud-10-0-110-146.
         [exec] Warning: Permanently added 'cloud-10-0-110-146,10.0.110.146' (ECDSA) to the list of known hosts.
         [exec] Warning: Permanently added 'cloud-10-0-110-146,10.0.110.146' (ECDSA) to the list of known hosts.
         [exec] rsync: link_stat "/tmp/dist/test-1-1/test-portal-acceptance-upstream(7.2.x)/835/dist/liferay-portal-bundle-websphere.*" failed: No such file or directory (2)
         [exec] rsync: link_stat "/tmp/dist/test-1-1/test-portal-acceptance-upstream(7.2.x)/835/dist/liferay-portal-bundle-websphere.*" failed: No such file or directory (2)
         [exec] rsync error: some files/attrs were not transferred (see previous errors) (code 23) at main.c(1650) [generator=3.1.2]
         [exec] 
         [exec] rsync error: some files/attrs were not transferred (see previous errors) (code 23) at main.c(1650) [generator=3.1.2]
         [exec] 
         [exec] real	0m0.670s
         [exec] user	0m0.228s
         [exec] sys	0m0.075s
         [exec] real	0m0.670s
         [exec] user	0m0.228s
         [exec] sys	0m0.075s
       [delete] Deleting: /opt/dev/projects/github/liferay-jenkins-ee/commands/20191112100417427
        [retry] Attempt [4]: error occurred; retrying...
         [echo] Retrieving {liferay-portal-source,liferay-portal-bundle-websphere}.* from cloud-10-0-10-27.
         [exec] Warning: Permanently added 'cloud-10-0-10-27,10.0.10.27' (ECDSA) to the list of known hosts.
         [exec] Warning: Permanently added 'cloud-10-0-10-27,10.0.10.27' (ECDSA) to the list of known hosts.
         [exec] rsync: link_stat "/tmp/dist/test-1-1/test-portal-acceptance-upstream(7.2.x)/835/dist/liferay-portal-bundle-websphere.*" failed: No such file or directory (2)
         [exec] rsync: link_stat "/tmp/dist/test-1-1/test-portal-acceptance-upstream(7.2.x)/835/dist/liferay-portal-bundle-websphere.*" failed: No such file or directory (2)
         [exec] rsync error: some files/attrs were not transferred (see previous errors) (code 23) at main.c(1650) [generator=3.1.2]
         [exec] 
         [exec] rsync error: some files/attrs were not transferred (see previous errors) (code 23) at main.c(1650) [generator=3.1.2]
         [exec] 
         [exec] real	0m0.728s
         [exec] user	0m0.222s
         [exec] sys	0m0.081s
         [exec] real	0m0.728s
         [exec] user	0m0.222s
         [exec] sys	0m0.081s
       [delete] Deleting: /opt/dev/projects/github/liferay-jenkins-ee/commands/20191112100418126
        [retry] Attempt [5]: error occurred; retrying...
         [echo] Retrieving {liferay-portal-source,liferay-portal-bundle-websphere}.* from cloud-10-0-13-139.
         [exec] Warning: Permanently added 'cloud-10-0-13-139,10.0.13.139' (ECDSA) to the list of known hosts.
         [exec] Warning: Permanently added 'cloud-10-0-13-139,10.0.13.139' (ECDSA) to the list of known hosts.
         [exec] rsync: change_dir "/tmp/dist/test-1-1/test-portal-acceptance-upstream(7.2.x)/835/dist" failed: No such file or directory (2)
         [exec] rsync: change_dir "/tmp/dist/test-1-1/test-portal-acceptance-upstream(7.2.x)/835/dist" failed: No such file or directory (2)
         [exec] rsync: change_dir "/tmp/dist/test-1-1/test-portal-acceptance-upstream(7.2.x)/835/dist" failed: No such file or directory (2)
         [exec] rsync: change_dir "/tmp/dist/test-1-1/test-portal-acceptance-upstream(7.2.x)/835/dist" failed: No such file or directory (2)
         [exec] rsync error: some files/attrs were not transferred (see previous errors) (code 23) at main.c(1650) [Receiver=3.1.2]
         [exec] rsync error: some files/attrs were not transferred (see previous errors) (code 23) at main.c(1650) [Receiver=3.1.2]
         [exec] rsync: [Receiver] write error: Broken pipe (32)
         [exec] 
         [exec] real	0m0.255s
         [exec] user	0m0.010s
         [exec] sys	0m0.005s
         [exec] rsync: [Receiver] write error: Broken pipe (32)
         [exec] 
         [exec] real	0m0.255s
         [exec] user	0m0.010s
         [exec] sys	0m0.005s
       [delete] Deleting: /opt/dev/projects/github/liferay-jenkins-ee/commands/20191112100418868
        [retry] Attempt [6]: error occurred; retrying...
         [echo] Retrieving {liferay-portal-source,liferay-portal-bundle-websphere}.* from cloud-10-0-110-87.
         [exec] rsync: link_stat "/tmp/dist/test-1-1/test-portal-acceptance-upstream(7.2.x)/835/dist/liferay-portal-bundle-websphere.*" failed: No such file or directory (2)
         [exec] rsync: link_stat "/tmp/dist/test-1-1/test-portal-acceptance-upstream(7.2.x)/835/dist/liferay-portal-bundle-websphere.*" failed: No such file or directory (2)
         [exec] rsync error: some files/attrs were not transferred (see previous errors) (code 23) at main.c(1650) [generator=3.1.2]
         [exec] 
         [exec] rsync error: some files/attrs were not transferred (see previous errors) (code 23) at main.c(1650) [generator=3.1.2]
         [exec] 
         [exec] real	0m0.697s
         [exec] user	0m0.216s
         [exec] sys	0m0.081s
         [exec] real	0m0.697s
         [exec] user	0m0.216s
         [exec] sys	0m0.081s
       [delete] Deleting: /opt/dev/projects/github/liferay-jenkins-ee/commands/20191112100419137
        [retry] Attempt [7]: error occurred; retrying...
         [echo] Retrieving {liferay-portal-source,liferay-portal-bundle-websphere}.* from cloud-10-0-13-145.
         [exec] rsync: link_stat "/tmp/dist/test-1-1/test-portal-acceptance-upstream(7.2.x)/835/dist/liferay-portal-bundle-websphere.*" failed: No such file or directory (2)
         [exec] rsync: link_stat "/tmp/dist/test-1-1/test-portal-acceptance-upstream(7.2.x)/835/dist/liferay-portal-bundle-websphere.*" failed: No such file or directory (2)
         [exec] rsync error: some files/attrs were not transferred (see previous errors) (code 23) at main.c(1650) [generator=3.1.2]
         [exec] 
         [exec] rsync error: some files/attrs were not transferred (see previous errors) (code 23) at main.c(1650) [generator=3.1.2]
         [exec] 
         [exec] real	0m0.743s
         [exec] user	0m0.226s
         [exec] sys	0m0.074s
         [exec] real	0m0.743s
         [exec] user	0m0.226s
         [exec] sys	0m0.074s
       [delete] Deleting: /opt/dev/projects/github/liferay-jenkins-ee/commands/20191112100419847
        [retry] Attempt [8]: error occurred; retrying...
         [echo] Retrieving {liferay-portal-source,liferay-portal-bundle-websphere}.* from cloud-10-0-16-148.
         [exec] Warning: Permanently added 'cloud-10-0-16-148,10.0.16.148' (ECDSA) to the list of known hosts.
         [exec] Warning: Permanently added 'cloud-10-0-16-148,10.0.16.148' (ECDSA) to the list of known hosts.
         [exec] rsync: link_stat "/tmp/dist/test-1-1/test-portal-acceptance-upstream(7.2.x)/835/dist/liferay-portal-bundle-websphere.*" failed: No such file or directory (2)
         [exec] rsync: link_stat "/tmp/dist/test-1-1/test-portal-acceptance-upstream(7.2.x)/835/dist/liferay-portal-bundle-websphere.*" failed: No such file or directory (2)
         [exec] rsync error: some files/attrs were not transferred (see previous errors) (code 23) at main.c(1650) [generator=3.1.2]
         [exec] 
         [exec] rsync error: some files/attrs were not transferred (see previous errors) (code 23) at main.c(1650) [generator=3.1.2]
         [exec] 
         [exec] real	0m0.643s
         [exec] user	0m0.214s
         [exec] sys	0m0.064s
         [exec] real	0m0.643s
         [exec] user	0m0.214s
         [exec] sys	0m0.064s
       [delete] Deleting: /opt/dev/projects/github/liferay-jenkins-ee/commands/20191112100420603
        [retry] Attempt [9]: error occurred; retrying...
         [echo] Retrieving {liferay-portal-source,liferay-portal-bundle-websphere}.* from cloud-10-0-110-146.
         [exec] rsync: link_stat "/tmp/dist/test-1-1/test-portal-acceptance-upstream(7.2.x)/835/dist/liferay-portal-bundle-websphere.*" failed: No such file or directory (2)
         [exec] rsync: link_stat "/tmp/dist/test-1-1/test-portal-acceptance-upstream(7.2.x)/835/dist/liferay-portal-bundle-websphere.*" failed: No such file or directory (2)
         [exec] rsync error: some files/attrs were not transferred (see previous errors) (code 23) at main.c(1650) [generator=3.1.2]
         [exec] 
         [exec] rsync error: some files/attrs were not transferred (see previous errors) (code 23) at main.c(1650) [generator=3.1.2]
         [exec] 
         [exec] real	0m0.641s
         [exec] user	0m0.214s
         [exec] sys	0m0.064s
         [exec] real	0m0.641s
         [exec] user	0m0.214s
         [exec] sys	0m0.064s
       [delete] Deleting: /opt/dev/projects/github/liferay-jenkins-ee/commands/20191112100421261
        [retry] Attempt [10]: error occurred; retrying...
         [echo] Retrieving {liferay-portal-source,liferay-portal-bundle-websphere}.* from cloud-10-0-10-18.
         [exec] Warning: Permanently added 'cloud-10-0-10-18,10.0.10.18' (ECDSA) to the list of known hosts.
         [exec] Warning: Permanently added 'cloud-10-0-10-18,10.0.10.18' (ECDSA) to the list of known hosts.
         [exec] rsync: link_stat "/tmp/dist/test-1-1/test-portal-acceptance-upstream(7.2.x)/835/dist/liferay-portal-bundle-websphere.*" failed: No such file or directory (2)
         [exec] rsync: link_stat "/tmp/dist/test-1-1/test-portal-acceptance-upstream(7.2.x)/835/dist/liferay-portal-bundle-websphere.*" failed: No such file or directory (2)
         [exec] rsync error: some files/attrs were not transferred (see previous errors) (code 23) at main.c(1650) [generator=3.1.2]
         [exec] 
         [exec] rsync error: some files/attrs were not transferred (see previous errors) (code 23) at main.c(1650) [generator=3.1.2]
         [exec] 
         [exec] real	0m0.706s
         [exec] user	0m0.220s
         [exec] sys	0m0.057s
         [exec] real	0m0.706s
         [exec] user	0m0.220s
         [exec] sys	0m0.057s
       [delete] Deleting: /opt/dev/projects/github/liferay-jenkins-ee/commands/20191112100421913
        [retry] Attempt [11]: error occurred; retrying...
         [echo] Retrieving {liferay-portal-source,liferay-portal-bundle-websphere}.* from cloud-10-0-19-51.
         [exec] ssh: connect to host cloud-10-0-19-51 port 22: Connection refused
         [exec] ssh: connect to host cloud-10-0-19-51 port 22: Connection refused
         [exec] rsync: connection unexpectedly closed (0 bytes received so far) [Receiver]
         [exec] rsync error: unexplained error (code 255) at io.c(226) [Receiver=3.1.2]
         [exec] 
         [exec] real	0m0.006s
         [exec] user	0m0.004s
         [exec] sys	0m0.001s
         [exec] rsync: connection unexpectedly closed (0 bytes received so far) [Receiver]
         [exec] rsync error: unexplained error (code 255) at io.c(226) [Receiver=3.1.2]
         [exec] 
         [exec] real	0m0.006s
         [exec] user	0m0.004s
         [exec] sys	0m0.001s
       [delete] Deleting: /opt/dev/projects/github/liferay-jenkins-ee/commands/20191112100422632
        [retry] Attempt [12]: error occurred; retrying...
         [echo] Retrieving {liferay-portal-source,liferay-portal-bundle-websphere}.* from cloud-10-0-110-216.
         [exec] Warning: Permanently added 'cloud-10-0-110-216,10.0.110.216' (ECDSA) to the list of known hosts.
         [exec] Warning: Permanently added 'cloud-10-0-110-216,10.0.110.216' (ECDSA) to the list of known hosts.
         [exec] rsync: link_stat "/tmp/dist/test-1-1/test-portal-acceptance-upstream(7.2.x)/835/dist/liferay-portal-bundle-websphere.*" failed: No such file or directory (2)
         [exec] rsync: link_stat "/tmp/dist/test-1-1/test-portal-acceptance-upstream(7.2.x)/835/dist/liferay-portal-bundle-websphere.*" failed: No such file or directory (2)
         [exec] rsync error: some files/attrs were not transferred (see previous errors) (code 23) at main.c(1650) [generator=3.1.2]
         [exec] 
         [exec] rsync error: some files/attrs were not transferred (see previous errors) (code 23) at main.c(1650) [generator=3.1.2]
         [exec] 
         [exec] real	0m0.750s
         [exec] user	0m0.222s
         [exec] sys	0m0.059s
         [exec] real	0m0.750s
         [exec] user	0m0.222s
         [exec] sys	0m0.059s
       [delete] Deleting: /opt/dev/projects/github/liferay-jenkins-ee/commands/20191112100422649
        [retry] Attempt [13]: error occurred; retrying...
         [echo] Retrieving {liferay-portal-source,liferay-portal-bundle-websphere}.* from cloud-10-0-10-141.
         [exec] Warning: Permanently added 'cloud-10-0-10-141,10.0.10.141' (ECDSA) to the list of known hosts.
         [exec] Warning: Permanently added 'cloud-10-0-10-141,10.0.10.141' (ECDSA) to the list of known hosts.
         [exec] rsync: link_stat "/tmp/dist/test-1-1/test-portal-acceptance-upstream(7.2.x)/835/dist/liferay-portal-bundle-websphere.*" failed: No such file or directory (2)
         [exec] rsync: link_stat "/tmp/dist/test-1-1/test-portal-acceptance-upstream(7.2.x)/835/dist/liferay-portal-bundle-websphere.*" failed: No such file or directory (2)
         [exec] rsync error: some files/attrs were not transferred (see previous errors) (code 23) at main.c(1650) [generator=3.1.2]
         [exec] 
         [exec] rsync error: some files/attrs were not transferred (see previous errors) (code 23) at main.c(1650) [generator=3.1.2]
         [exec] 
         [exec] real	0m0.970s
         [exec] user	0m0.234s
         [exec] sys	0m0.053s
         [exec] real	0m0.970s
         [exec] user	0m0.234s
         [exec] sys	0m0.053s
       [delete] Deleting: /opt/dev/projects/github/liferay-jenkins-ee/commands/20191112100423409
        [retry] Attempt [14]: error occurred; retrying...
         [echo] Retrieving {liferay-portal-source,liferay-portal-bundle-websphere}.* from cloud-10-0-13-139.
         [exec] rsync: change_dir "/tmp/dist/test-1-1/test-portal-acceptance-upstream(7.2.x)/835/dist" failed: No such file or directory (2)
         [exec] rsync: change_dir "/tmp/dist/test-1-1/test-portal-acceptance-upstream(7.2.x)/835/dist" failed: No such file or directory (2)
         [exec] rsync: change_dir "/tmp/dist/test-1-1/test-portal-acceptance-upstream(7.2.x)/835/dist" failed: No such file or directory (2)
         [exec] rsync: change_dir "/tmp/dist/test-1-1/test-portal-acceptance-upstream(7.2.x)/835/dist" failed: No such file or directory (2)
         [exec] rsync error: some files/attrs were not transferred (see previous errors) (code 23) at main.c(1650) [Receiver=3.1.2]
         [exec] rsync error: some files/attrs were not transferred (see previous errors) (code 23) at main.c(1650) [Receiver=3.1.2]
         [exec] rsync: [Receiver] write error: Broken pipe (32)
         [exec] 
         [exec] real	0m0.255s
         [exec] user	0m0.010s
         [exec] sys	0m0.004s
         [exec] rsync: [Receiver] write error: Broken pipe (32)
         [exec] 
         [exec] real	0m0.255s
         [exec] user	0m0.010s
         [exec] sys	0m0.004s
       [delete] Deleting: /opt/dev/projects/github/liferay-jenkins-ee/commands/20191112100424391
        [retry] Attempt [15]: error occurred; retrying...
         [echo] Retrieving {liferay-portal-source,liferay-portal-bundle-websphere}.* from cloud-10-0-16-143.
         [exec] Warning: Permanently added 'cloud-10-0-16-143,10.0.16.143' (ECDSA) to the list of known hosts.
         [exec] Warning: Permanently added 'cloud-10-0-16-143,10.0.16.143' (ECDSA) to the list of known hosts.
         [exec] rsync: link_stat "/tmp/dist/test-1-1/test-portal-acceptance-upstream(7.2.x)/835/dist/liferay-portal-bundle-websphere.*" failed: No such file or directory (2)
         [exec] rsync: link_stat "/tmp/dist/test-1-1/test-portal-acceptance-upstream(7.2.x)/835/dist/liferay-portal-bundle-websphere.*" failed: No such file or directory (2)
         [exec] rsync error: some files/attrs were not transferred (see previous errors) (code 23) at main.c(1650) [generator=3.1.2]
         [exec] 
         [exec] rsync error: some files/attrs were not transferred (see previous errors) (code 23) at main.c(1650) [generator=3.1.2]
         [exec] 
         [exec] real	0m0.685s
         [exec] user	0m0.222s
         [exec] sys	0m0.055s
         [exec] real	0m0.685s
         [exec] user	0m0.222s
         [exec] sys	0m0.055s
       [delete] Deleting: /opt/dev/projects/github/liferay-jenkins-ee/commands/20191112100424657
        [retry] Attempt [16]: error occurred; retrying...
         [echo] Retrieving {liferay-portal-source,liferay-portal-bundle-websphere}.* from cloud-10-0-13-145.
         [exec] rsync: link_stat "/tmp/dist/test-1-1/test-portal-acceptance-upstream(7.2.x)/835/dist/liferay-portal-bundle-websphere.*" failed: No such file or directory (2)
         [exec] rsync: link_stat "/tmp/dist/test-1-1/test-portal-acceptance-upstream(7.2.x)/835/dist/liferay-portal-bundle-websphere.*" failed: No such file or directory (2)
         [exec] rsync error: some files/attrs were not transferred (see previous errors) (code 23) at main.c(1650) [generator=3.1.2]
         [exec] 
         [exec] rsync error: some files/attrs were not transferred (see previous errors) (code 23) at main.c(1650) [generator=3.1.2]
         [exec] 
         [exec] real	0m0.646s
         [exec] user	0m0.214s
         [exec] sys	0m0.065s
         [exec] real	0m0.646s
         [exec] user	0m0.214s
         [exec] sys	0m0.065s
       [delete] Deleting: /opt/dev/projects/github/liferay-jenkins-ee/commands/20191112100425352
        [retry] Attempt [17]: error occurred; retrying...
         [echo] Retrieving {liferay-portal-source,liferay-portal-bundle-websphere}.* from cloud-10-0-16-148.
         [exec] rsync: link_stat "/tmp/dist/test-1-1/test-portal-acceptance-upstream(7.2.x)/835/dist/liferay-portal-bundle-websphere.*" failed: No such file or directory (2)
         [exec] rsync: link_stat "/tmp/dist/test-1-1/test-portal-acceptance-upstream(7.2.x)/835/dist/liferay-portal-bundle-websphere.*" failed: No such file or directory (2)
         [exec] rsync error: some files/attrs were not transferred (see previous errors) (code 23) at main.c(1650) [generator=3.1.2]
         [exec] 
         [exec] rsync error: some files/attrs were not transferred (see previous errors) (code 23) at main.c(1650) [generator=3.1.2]
         [exec] 
         [exec] real	0m0.640s
         [exec] user	0m0.214s
         [exec] sys	0m0.063s
         [exec] real	0m0.640s
         [exec] user	0m0.214s
         [exec] sys	0m0.063s
       [delete] Deleting: /opt/dev/projects/github/liferay-jenkins-ee/commands/20191112100426008
        [retry] Attempt [18]: error occurred; retrying...
         [echo] Retrieving {liferay-portal-source,liferay-portal-bundle-websphere}.* from cloud-10-0-19-33.
         [exec] Warning: Permanently added 'cloud-10-0-19-33,10.0.19.33' (ECDSA) to the list of known hosts.
         [exec] Warning: Permanently added 'cloud-10-0-19-33,10.0.19.33' (ECDSA) to the list of known hosts.
         [exec] rsync: link_stat "/tmp/dist/test-1-1/test-portal-acceptance-upstream(7.2.x)/835/dist/liferay-portal-bundle-websphere.*" failed: No such file or directory (2)
         [exec] rsync: link_stat "/tmp/dist/test-1-1/test-portal-acceptance-upstream(7.2.x)/835/dist/liferay-portal-bundle-websphere.*" failed: No such file or directory (2)
         [exec] rsync error: some files/attrs were not transferred (see previous errors) (code 23) at main.c(1650) [generator=3.1.2]
         [exec] 
         [exec] rsync error: some files/attrs were not transferred (see previous errors) (code 23) at main.c(1650) [generator=3.1.2]
         [exec] 
         [exec] real	0m0.637s
         [exec] user	0m0.216s
         [exec] sys	0m0.063s
         [exec] real	0m0.637s
         [exec] user	0m0.216s
         [exec] sys	0m0.063s
       [delete] Deleting: /opt/dev/projects/github/liferay-jenkins-ee/commands/20191112100426658
        [retry] Attempt [19]: error occurred; retrying...
         [echo] Retrieving {liferay-portal-source,liferay-portal-bundle-websphere}.* from cloud-10-0-16-143.
         [exec] rsync: link_stat "/tmp/dist/test-1-1/test-portal-acceptance-upstream(7.2.x)/835/dist/liferay-portal-bundle-websphere.*" failed: No such file or directory (2)
         [exec] rsync: link_stat "/tmp/dist/test-1-1/test-portal-acceptance-upstream(7.2.x)/835/dist/liferay-portal-bundle-websphere.*" failed: No such file or directory (2)
         [exec] rsync error: some files/attrs were not transferred (see previous errors) (code 23) at main.c(1650) [generator=3.1.2]
         [exec] 
         [exec] rsync error: some files/attrs were not transferred (see previous errors) (code 23) at main.c(1650) [generator=3.1.2]
         [exec] 
         [exec] real	0m0.727s
         [exec] user	0m0.231s
         [exec] sys	0m0.069s
         [exec] real	0m0.727s
         [exec] user	0m0.231s
         [exec] sys	0m0.069s
    

      Attachments

        Activity

          People

          • Assignee:
            support-lep@liferay.com SE Support
            Reporter:
            kristin.onias Kristin Onias
            Recent user:
            Raven Song
            Participants of an Issue:
          • Votes:
            0 Vote for this issue
            Watchers:
            0 Start watching this issue

            Dates

            • Created:
              Updated:

              Packages

              Version Package