Uploaded image for project: 'PUBLIC - Liferay Portal Community Edition'
  1. PUBLIC - Liferay Portal Community Edition
  2. LPS-104587

Execution Exception in CPSharepoint2013 and PGSharepoint2013

    Details

    • Type: Regression Bug
    • Status: Reopened
    • Resolution: Unresolved
    • Affects Version/s: Master
    • Fix Version/s: None
    • Component/s: Collaboration

      Description

      https://testray.liferay.com/home/-/testray/subtasks/873794868/view?cur=1&delta=20&testraySubtaskId=873794868

           [exec]     BUILD FAILED
           [exec]     /opt/dev/projects/github/liferay-portal/build-test-sharepoint.xml:7: The following error occurred while executing this line:
           [exec]     /opt/dev/projects/github/liferay-portal/build-common.xml:1844: com.jcraft.jsch.JSchException: java.net.NoRouteToHostException: No route to host (Host unreachable)
           [exec]     	at com.jcraft.jsch.Util.createSocket(Util.java:344)
           [exec]     	at com.jcraft.jsch.Session.connect(Session.java:215)
           [exec]     	at com.jcraft.jsch.Session.connect(Session.java:183)
           [exec]     	at org.apache.tools.ant.taskdefs.optional.ssh.SSHBase.openSession(SSHBase.java:225)
           [exec]     	at org.apache.tools.ant.taskdefs.optional.ssh.SSHExec.execute(SSHExec.java:312)
           [exec]     	at org.apache.tools.ant.UnknownElement.execute(UnknownElement.java:292)
           [exec]     	at sun.reflect.GeneratedMethodAccessor4.invoke(Unknown Source)
           [exec]     	at sun.reflect.DelegatingMethodAccessorImpl.invoke(DelegatingMethodAccessorImpl.java:43)
           [exec]     	at java.lang.reflect.Method.invoke(Method.java:498)
           [exec]     	at org.apache.tools.ant.dispatch.DispatchUtils.execute(DispatchUtils.java:106)
           [exec]     	at org.apache.tools.ant.Task.perform(Task.java:348)
           [exec]     	at org.apache.tools.ant.taskdefs.Sequential.execute(Sequential.java:68)
           [exec]     	at org.apache.tools.ant.UnknownElement.execute(UnknownElement.java:292)
           [exec]     	at sun.reflect.GeneratedMethodAccessor4.invoke(Unknown Source)
           [exec]     	at sun.reflect.DelegatingMethodAccessorImpl.invoke(DelegatingMethodAccessorImpl.java:43)
           [exec]     	at java.lang.reflect.Method.invoke(Method.java:498)
           [exec]     	at org.apache.tools.ant.dispatch.DispatchUtils.execute(DispatchUtils.java:106)
           [exec]     	at org.apache.tools.ant.Task.perform(Task.java:348)
           [exec]     	at org.apache.tools.ant.taskdefs.MacroInstance.execute(MacroInstance.java:396)
           [exec]     	at org.apache.tools.ant.UnknownElement.execute(UnknownElement.java:292)
           [exec]     	at sun.reflect.GeneratedMethodAccessor4.invoke(Unknown Source)
           [exec]     	at sun.reflect.DelegatingMethodAccessorImpl.invoke(DelegatingMethodAccessorImpl.java:43)
           [exec]     	at java.lang.reflect.Method.invoke(Method.java:498)
           [exec]     	at org.apache.tools.ant.dispatch.DispatchUtils.execute(DispatchUtils.java:106)
           [exec]     	at org.apache.tools.ant.Task.perform(Task.java:348)
           [exec]     	at org.apache.tools.ant.Target.execute(Target.java:435)
           [exec]     	at org.apache.tools.ant.Target.performTasks(Target.java:456)
           [exec]     	at org.apache.tools.ant.Project.executeSortedTargets(Project.java:1393)
           [exec]     	at org.apache.tools.ant.Project.executeTarget(Project.java:1364)
           [exec]     	at org.apache.tools.ant.helper.DefaultExecutor.executeTargets(DefaultExecutor.java:41)
           [exec]     	at org.apache.tools.ant.Project.executeTargets(Project.java:1248)
           [exec]     	at org.apache.tools.ant.Main.runBuild(Main.java:851)
           [exec]     	at org.apache.tools.ant.Main.startAnt(Main.java:235)
           [exec]     	at org.apache.tools.ant.launch.Launcher.run(Launcher.java:280)
           [exec]     	at org.apache.tools.ant.launch.Launcher.main(Launcher.java:109)
           [exec]     Caused by: java.net.NoRouteToHostException: No route to host (Host unreachable)
           [exec]     	at java.net.PlainSocketImpl.socketConnect(Native Method)
           [exec]     	at java.net.AbstractPlainSocketImpl.doConnect(AbstractPlainSocketImpl.java:350)
           [exec]     	at java.net.AbstractPlainSocketImpl.connectToAddress(AbstractPlainSocketImpl.java:206)
           [exec]     	at java.net.AbstractPlainSocketImpl.connect(AbstractPlainSocketImpl.java:188)
           [exec]     	at java.net.SocksSocketImpl.connect(SocksSocketImpl.java:392)
           [exec]     	at java.net.Socket.connect(Socket.java:589)
           [exec]     	at java.net.Socket.connect(Socket.java:538)
           [exec]     	at java.net.Socket.<init>(Socket.java:434)
           [exec]     	at java.net.Socket.<init>(Socket.java:211)
           [exec]     	at com.jcraft.jsch.Util.createSocket(Util.java:338)
           [exec]     	... 34 more
           [exec] 
           [exec]     Total time: 4 seconds
           [exec] 
           [exec]     BUILD FAILED: java.lang.Exception
           [exec]     /opt/dev/projects/github/liferay-portal/portal-web/test/functional/com/liferay/portalweb/tests/enduseree/collaborationanddocmanagement/documentmanagement/connectors/sharepoint/CPSharepoint2013.testcase[set-up]:18
      

        Attachments

          Activity

            People

            • Votes:
              0 Vote for this issue
              Watchers:
              0 Start watching this issue

              Dates

              • Created:
                Updated:
                Days since last comment:
                2 weeks, 4 days ago

                Packages

                Version Package