Uploaded image for project: 'PUBLIC - Liferay Portal Community Edition'
  1. PUBLIC - Liferay Portal Community Edition
  2. LPS-104815

Investigate js-unit-private-jdk8/0 failure in Workflow

    Details

    • Type: Regression Bug
    • Status: Closed
    • Resolution: No Longer Reproducible
    • Affects Version/s: Master
    • Fix Version/s: None
    • Component/s: Workflow

      Description

      Testray Results: https://testray.liferay.com/home/-/testray/case_results/884592096
      Full Jenkins Log: https://testray.liferay.com/reports/production/logs/test-1-1/1574186551929/test-portal-acceptance-upstream(master)/6892/js-unit-private-jdk8/0/jenkins-console.txt.gz
      Jenkins: https://test-1-3.liferay.com/job/test-portal-acceptance-upstream-batch(master)/AXIS_VARIABLE=0,label_exp=!master/48504/

         [exec] > Task :dxp:apps:portal-workflow:portal-workflow-kaleo-designer-web:packageRunTest
           [exec] [32m21 11 2019 06:52:11.532:INFO [Firefox 68.0.0 (Linux 0.0.0)]: [39mConnected on socket xtJXYr_OC2J0IlnbAAAA with id 48934360
           [exec] Firefox 68.0.0 (Linux 0.0.0): Executed 0 of 11[32m SUCCESS[39m (0 secs / 0 secs)
           [exec] [1A[2K[31mFirefox 68.0.0 (Linux 0.0.0) Liferay.KaleoDesignerXMLDefinitionSerializer "before all" hook FAILED[39m
           [exec]     timeout of 2000ms exceeded. Ensure the done() callback is being called in this test.
           [exec] Firefox 68.0.0 (Linux 0.0.0): Executed 1 of 11[31m (1 FAILED)[39m (0 secs / 2.037 secs)
           [exec] [1A[2K[31mFirefox 68.0.0 (Linux 0.0.0) Liferay.KaleoDesignerXMLDefinition "before all" hook FAILED[39m
           [exec]     timeout of 2000ms exceeded. Ensure the done() callback is being called in this test.
           [exec] Firefox 68.0.0 (Linux 0.0.0): Executed 2 of 11[31m (2 FAILED)[39m (0 secs / 4.081 secs)
           [exec] [1A[2KFirefox 68.0.0 (Linux 0.0.0): Executed 2 of 11[31m (2 FAILED)[39m[31m ERROR[39m (4.399 secs / 4.081 secs)
           [exec] error Command failed with exit code 1.
           [exec] info Visit https://yarnpkg.com/en/docs/cli/run for documentation about this command.
           [exec] Process '[/opt/dev/projects/github/liferay-portal/build/node/bin/node, /opt/dev/projects/github/liferay-portal/modules/yarn-1.13.0.js, --production, false, --registry, http://mirrors.lax.liferay.com:4873, run, test]' finished with non-zero exit value 1
           [exec] 
      
      

       

        Attachments

          Activity

            People

            • Assignee:
              tai.nguyen Tai Nguyen
              Reporter:
              tai.nguyen Tai Nguyen
              Participants of an Issue:
              Recent user:
              Dennys Barros (Inactive)
            • Votes:
              0 Vote for this issue
              Watchers:
              0 Start watching this issue

              Dates

              • Created:
                Updated:
                Resolved:
                Days since last comment:
                43 weeks, 2 days ago

                Packages

                Version Package