Uploaded image for project: 'PUBLIC - Liferay Portal Community Edition'
  1. PUBLIC - Liferay Portal Community Edition
  2. LPS-105034

testScanBuildScripts-ModulesStructureTest failed due to version doesn't match

    Details

    • Type: Regression Bug
    • Status: Closed
    • Resolution: No Longer Reproducible
    • Affects Version/s: 7.1.X
    • Fix Version/s: 7.1.X
    • Component/s: Application Security
    • Labels:
      None
    • Fix Priority:
      3

      Description

      Testcase: testScanBuildScripts(com.liferay.portal.modules.ModulesStructureTest): FAILED on 7.1.x batch central-requirements-jdk8 CI tester.

      [junit] Testcase: testScanBuildScripts(com.liferay.portal.modules.ModulesStructureTest): FAILED
       [junit] Version must match the project version (2.0.0) modules/apps/frontend-js/frontend-js-react-web/package.json
       [junit] junit.framework.AssertionFailedError: Version must match the project version (2.0.0) modules/apps/frontend-js/frontend-js-react-web/package.json
       [junit] at com.liferay.portal.modules.ModulesStructureTest._testJSONVersion(ModulesStructureTest.java:1472)
       [junit] at com.liferay.portal.modules.ModulesStructureTest.access$500(ModulesStructureTest.java:66)
       [junit] at com.liferay.portal.modules.ModulesStructureTest$1.preVisitDirectory(ModulesStructureTest.java:255)
       [junit] at com.liferay.portal.modules.ModulesStructureTest$1.preVisitDirectory(ModulesStructureTest.java:122)
       [junit] at java.nio.file.Files.walkFileTree(Files.java:2677)
       [junit] at java.nio.file.Files.walkFileTree(Files.java:2742)
       [junit] at com.liferay.portal.modules.ModulesStructureTest.testScanBuildScripts(ModulesStructureTest.java:120)
       [junit] 
       [junit] 
       [junit] Test com.liferay.portal.modules.ModulesStructureTest FAILED

       

      Full console log:

      https://test-1-18.liferay.com/job/test-portal-acceptance-pullrequest-batch(7.1.x)/AXIS_VARIABLE=0,label_exp=!master/16189/consoleFull

        Attachments

          Activity

            People

            Assignee:
            della.wang Della Wang (Inactive)
            Reporter:
            della.wang Della Wang (Inactive)
            Participants of an Issue:
            Recent user:
            Della Wang (Inactive)
            Votes:
            0 Vote for this issue
            Watchers:
            0 Start watching this issue

              Dates

              Created:
              Updated:
              Resolved:
              Days since last comment:
              1 year, 19 weeks, 3 days ago

                Packages

                Version Package
                7.1.X