Uploaded image for project: 'PUBLIC - Liferay Portal Community Edition'
  1. PUBLIC - Liferay Portal Community Edition
  2. LPS-105814

Investigate packageRunTest failure in js-unit-private-jdk8/0

    Details

    • Type: Regression Bug
    • Status: Closed
    • Resolution: No Longer Reproducible
    • Affects Version/s: Master
    • Fix Version/s: None
    • Component/s: Workflow
    • Labels:

      Description

      Testray Results

      
        [exec] > Task :dxp:apps:portal-workflow:portal-workflow-kaleo-designer-web:packageRunTest
           [exec] Firefox 68.0.0 (Linux 0.0.0): Executed 0 of 12[32m SUCCESS[39m (0 secs / 0 secs)
           [exec] [1A[2K[31mFirefox 68.0.0 (Linux 0.0.0) Liferay.KaleoDesignerXMLDefinitionSerializer "before all" hook FAILED[39m
           [exec] 	timeout of 2000ms exceeded. Ensure the done() callback is being called in this test.
           [exec] Firefox 68.0.0 (Linux 0.0.0): Executed 1 of 12[31m (1 FAILED)[39m (0 secs / 2.007 secs)
           [exec] [1A[2KFirefox 68.0.0 (Linux 0.0.0): Executed 2 of 12[31m (1 FAILED)[39m (0 secs / 2.22 secs)
           [exec] [1A[2KFirefox 68.0.0 (Linux 0.0.0): Executed 3 of 12[31m (1 FAILED)[39m (0 secs / 2.336 secs)
           [exec] [1A[2KFirefox 68.0.0 (Linux 0.0.0): Executed 4 of 12[31m (1 FAILED)[39m (0 secs / 3.793 secs)
           [exec] [1A[2KFirefox 68.0.0 (Linux 0.0.0): Executed 5 of 12[31m (1 FAILED)[39m (0 secs / 4.03 secs)
           [exec] [1A[2KFirefox 68.0.0 (Linux 0.0.0): Executed 6 of 12[31m (1 FAILED)[39m (0 secs / 4.122 secs)
           [exec] [1A[2KFirefox 68.0.0 (Linux 0.0.0): Executed 6 of 12[31m (1 FAILED)[39m (5.771 secs / 4.122 secs)
           [exec] [31mTOTAL: 1 FAILED, 5 SUCCESS[39m
           [exec] error Command failed with exit code 1.
      
      

        Attachments

          Activity

            People

            • Votes:
              0 Vote for this issue
              Watchers:
              0 Start watching this issue

              Dates

              • Created:
                Updated:
                Resolved:
                Days since last comment:
                10 weeks, 4 days ago

                Packages

                Version Package