Uploaded image for project: 'PUBLIC - Liferay Portal Community Edition'
  1. PUBLIC - Liferay Portal Community Edition
  2. LPS-105913

Task apps:frontend-taglib:frontend-taglib-clay:packageRunBuild failed when execute Gradle task:deploy

    Details

    • Type: Regression Bug
    • Status: Closed
    • Resolution: Fixed
    • Affects Version/s: 7.1.X
    • Fix Version/s: 7.1.X
    • Component/s: ~[Archived] UI Taglibs
    • Labels:
      None
    • Fix Priority:
      5

      Description

      Occurred on 71 acceptance CI tester:

      [exec] * What went wrong:
       [exec] Execution failed for task ':apps:frontend-taglib:frontend-taglib-clay:packageRunBuild'.
       [exec] > java.io.IOException: Process '[/opt/dev/projects/github/liferay-portal-7.1.x/build/node/bin/node, /opt/dev/projects/github/liferay-portal-7.1.x/modules/yarn-1.13.0.js, --production, false, --registry, 
       http://mirrors.lax.liferay.com:4873
       , run, build]' finished with non-zero exit value 1
       [exec] 
       [exec] * Try:
       [exec] Run with --info or --debug option to get more log output. Run with --scan to get full insights.
       [exec] 
       [exec] * Exception is:
       [exec] org.gradle.api.tasks.TaskExecutionException: Execution failed for task ':apps:frontend-taglib:frontend-taglib-clay:packageRunBuild'.
       [exec] at org.gradle.api.internal.tasks.execution.ExecuteActionsTaskExecuter$3.accept(ExecuteActionsTaskExecuter.java:166)
       [exec] at org.gradle.api.internal.tasks.execution.ExecuteActionsTaskExecuter$3.accept(ExecuteActionsTaskExecuter.java:163)
       [exec] at org.gradle.internal.Try$Failure.ifSuccessfulOrElse(Try.java:191)
       [exec] at org.gradle.api.internal.tasks.execution.ExecuteActionsTaskExecuter.execute(ExecuteActionsTaskExecuter.java:156)
       [exec] at org.gradle.api.internal.tasks.execution.ValidatingTaskExecuter.execute(ValidatingTaskExecuter.java:62)
       [exec] at org.gradle.api.internal.tasks.execution.SkipEmptySourceFilesTaskExecuter.execute(SkipEmptySourceFilesTaskExecuter.java:108)
       [exec] at org.gradle.api.internal.tasks.execution.ResolveBeforeExecutionOutputsTaskExecuter.execute(ResolveBeforeExecutionOutputsTaskExecuter.java:67)
       [exec] at org.gradle.api.internal.tasks.execution.ResolveAfterPreviousExecutionStateTaskExecuter.execute(ResolveAfterPreviousExecutionStateTaskExecuter.java:46)
       [exec] at org.gradle.api.internal.tasks.execution.CleanupStaleOutputsExecuter.execute(CleanupStaleOutputsExecuter.java:94)
       [exec] at org.gradle.api.internal.tasks.execution.FinalizePropertiesTaskExecuter.execute(FinalizePropertiesTaskExecuter.java:46)
       [exec] at org.gradle.api.internal.tasks.execution.ResolveTaskExecutionModeExecuter.execute(ResolveTaskExecutionModeExecuter.java:95)
       [exec] at org.gradle.api.internal.tasks.execution.SkipTaskWithNoActionsExecuter.execute(SkipTaskWithNoActionsExecuter.java:57)
       [exec] at org.gradle.api.internal.tasks.execution.SkipOnlyIfTaskExecuter.execute(SkipOnlyIfTaskExecuter.java:56)
       [exec] at org.gradle.api.internal.tasks.execution.CatchExceptionTaskExecuter.execute(CatchExceptionTaskExecuter.java:36)
       [exec] at org.gradle.api.internal.tasks.execution.EventFiringTaskExecuter$1.executeTask(EventFiringTaskExecuter.java:77)
       [exec] at org.gradle.api.internal.tasks.execution.EventFiringTaskExecuter$1.call(EventFiringTaskExecuter.java:55)
       [exec] at org.gradle.api.internal.tasks.execution.EventFiringTaskExecuter$1.call(EventFiringTaskExecuter.java:52)
       [exec] at org.gradle.internal.operations.DefaultBuildOperationExecutor$CallableBuildOperationWorker.execute(DefaultBuildOperationExecutor.java:416)
       [exec] at org.gradle.internal.operations.DefaultBuildOperationExecutor$CallableBuildOperationWorker.execute(DefaultBuildOperationExecutor.java:406)
       [exec] at org.gradle.internal.operations.DefaultBuildOperationExecutor$1.execute(DefaultBuildOperationExecutor.java:165)
       [exec] at org.gradle.internal.operations.DefaultBuildOperationExecutor.execute(DefaultBuildOperationExecutor.java:250)
       [exec] at org.gradle.internal.operations.DefaultBuildOperationExecutor.execute(DefaultBuildOperationExecutor.java:158)
       [exec] at org.gradle.internal.operations.DefaultBuildOperationExecutor.call(DefaultBuildOperationExecutor.java:102)
       [exec] at org.gradle.internal.operations.DelegatingBuildOperationExecutor.call(DelegatingBuildOperationExecutor.java:36)
       [exec] at org.gradle.api.internal.tasks.execution.EventFiringTaskExecuter.execute(EventFiringTaskExecuter.java:52)
       [exec] at org.gradle.execution.plan.LocalTaskNodeExecutor.execute(LocalTaskNodeExecutor.java:43)
       [exec] at org.gradle.execution.taskgraph.DefaultTaskExecutionGraph$InvokeNodeExecutorsAction.execute(DefaultTaskExecutionGraph.java:355)
       [exec] at org.gradle.execution.taskgraph.DefaultTaskExecutionGraph$InvokeNodeExecutorsAction.execute(DefaultTaskExecutionGraph.java:343)
       [exec] at org.gradle.execution.taskgraph.DefaultTaskExecutionGraph$BuildOperationAwareExecutionAction.execute(DefaultTaskExecutionGraph.java:336)
       [exec] at org.gradle.execution.taskgraph.DefaultTaskExecutionGraph$BuildOperationAwareExecutionAction.execute(DefaultTaskExecutionGraph.java:322)
       [exec] at org.gradle.execution.plan.DefaultPlanExecutor$ExecutorWorker$1.execute(DefaultPlanExecutor.java:134)
       [exec] at org.gradle.execution.plan.DefaultPlanExecutor$ExecutorWorker$1.execute(DefaultPlanExecutor.java:129)
       [exec] at org.gradle.execution.plan.DefaultPlanExecutor$ExecutorWorker.execute(DefaultPlanExecutor.java:202)
       [exec] at org.gradle.execution.plan.DefaultPlanExecutor$ExecutorWorker.executeNextNode(DefaultPlanExecutor.java:193)
       [exec] at org.gradle.execution.plan.DefaultPlanExecutor$ExecutorWorker.run(DefaultPlanExecutor.java:129)
       [exec] at org.gradle.internal.concurrent.ExecutorPolicy$CatchAndRecordFailures.onExecute(ExecutorPolicy.java:64)
       [exec] at org.gradle.internal.concurrent.ManagedExecutorImpl$1.run(ManagedExecutorImpl.java:48)
       [exec] at org.gradle.internal.concurrent.ThreadFactoryImpl$ManagedThreadRunnable.run(ThreadFactoryImpl.java:56)
       [exec] Caused by: org.gradle.api.UncheckedIOException: java.io.IOException: Process '[/opt/dev/projects/github/liferay-portal-7.1.x/build/node/bin/node, /opt/dev/projects/github/liferay-portal-7.1.x/modules/yarn-1.13.0.js, --production, false, --registry, 
       http://mirrors.lax.liferay.com:4873
       , run, build]' finished with non-zero exit value 1

      Full console log:

      https://test-1-11.liferay.com/job/test-portal-acceptance-pullrequest(7.1.x)/471/consoleFull

        Attachments

          Issue Links

            Activity

              People

              Assignee:
              della.wang Della Wang (Inactive)
              Reporter:
              della.wang Della Wang (Inactive)
              Participants of an Issue:
              Recent user:
              Brian Lee
              Votes:
              0 Vote for this issue
              Watchers:
              0 Start watching this issue

                Dates

                Created:
                Updated:
                Resolved:
                Days since last comment:
                1 year, 11 weeks, 1 day ago

                  Packages

                  Version Package
                  7.1.X