Details

      Description

      Jenkins https://testray.liferay.com/reports/production/logs/test-1-1/1577397332957/test-portal-acceptance-upstream-dxp(7.2.x)/95/compile-jsp-jdk8/0/jenkins-console.txt.gz

      [exec] FAILURE: Build failed with an exception.
           [exec] 
           [exec] * What went wrong:
           [exec] Execution failed for task ':private:apps:osb-koroneiki:osb-koroneiki-root:osb-koroneiki-root-api:compileJava'.
           [exec] > Could not resolve all files for configuration ':private:apps:osb-koroneiki:osb-koroneiki-root:osb-koroneiki-root-api:compileClasspath'.
           [exec]    > Could not download com.liferay.portal.kernel.jar (com.liferay.portal:com.liferay.portal.kernel:4.0.0)
           [exec]       > Could not get resource 'http://repository-cdn.liferay.com/nexus/content/groups/public/com/liferay/portal/com.liferay.portal.kernel/4.0.0/com.liferay.portal.kernel-4.0.0.jar'.
           [exec]          > Could not GET 'http://repository-cdn.liferay.com/nexus/content/groups/public/com/liferay/portal/com.liferay.portal.kernel/4.0.0/com.liferay.portal.kernel-4.0.0.jar'.
           [exec]             > Read timed out
           [exec] 
           [exec] * Try:
           [exec] Run with --info or --debug option to get more log output. Run with --scan to get full insights.
           [exec] 
           [exec] * Exception is:
           [exec] org.gradle.api.tasks.TaskExecutionException: Execution failed for task ':private:apps:osb-koroneiki:osb-koroneiki-root:osb-koroneiki-root-api:compileJava'.
           [exec] 	at org.gradle.api.internal.tasks.execution.CatchExceptionTaskExecuter.execute(CatchExceptionTaskExecuter.java:38)
           [exec] 	at org.gradle.api.internal.tasks.execution.EventFiringTaskExecuter$1.executeTask(EventFiringTaskExecuter.java:77)
           [exec] 	at org.gradle.api.internal.tasks.execution.EventFiringTaskExecuter$1.call(EventFiringTaskExecuter.java:55)
           [exec] 	at org.gradle.api.internal.tasks.execution.EventFiringTaskExecuter$1.call(EventFiringTaskExecuter.java:52)
           [exec] 	at org.gradle.internal.operations.DefaultBuildOperationExecutor$CallableBuildOperationWorker.execute(DefaultBuildOperationExecutor.java:416)
           [exec] 	at org.gradle.internal.operations.DefaultBuildOperationExecutor$CallableBuildOperationWorker.execute(DefaultBuildOperationExecutor.java:406)
           [exec] 	at org.gradle.internal.operations.DefaultBuildOperationExecutor$1.execute(DefaultBuildOperationExecutor.java:165)
           [exec] 	at org.gradle.internal.operations.DefaultBuildOperationExecutor.execute(DefaultBuildOperationExecutor.java:250)
           [exec] 	at org.gradle.internal.operations.DefaultBuildOperationExecutor.execute(DefaultBuildOperationExecutor.java:158)
           [exec] 	at org.gradle.internal.operations.DefaultBuildOperationExecutor.call(DefaultBuildOperationExecutor.java:102)
           [exec] 	at org.gradle.internal.operations.DelegatingBuildOperationExecutor.call(DelegatingBuildOperationExecutor.java:36)
           [exec] 	at org.gradle.api.internal.tasks.execution.EventFiringTaskExecuter.execute(EventFiringTaskExecuter.java:52)
           [exec] 	at org.gradle.execution.plan.LocalTaskNodeExecutor.execute(LocalTaskNodeExecutor.java:43)
           [exec] 	at org.gradle.execution.taskgraph.DefaultTaskExecutionGraph$InvokeNodeExecutorsAction.execute(DefaultTaskExecutionGraph.java:355)
           [exec] 	at org.gradle.execution.taskgraph.DefaultTaskExecutionGraph$InvokeNodeExecutorsAction.execute(DefaultTaskExecutionGraph.java:343)
           [exec] 	at org.gradle.execution.taskgraph.DefaultTaskExecutionGraph$BuildOperationAwareExecutionAction.execute(DefaultTaskExecutionGraph.java:336)
           [exec] 	at org.gradle.execution.taskgraph.DefaultTaskExecutionGraph$BuildOperationAwareExecutionAction.execute(DefaultTaskExecutionGraph.java:322)
           [exec] 	at org.gradle.execution.plan.DefaultPlanExecutor$ExecutorWorker$1.execute(DefaultPlanExecutor.java:134)
           [exec] 	at org.gradle.execution.plan.DefaultPlanExecutor$ExecutorWorker$1.execute(DefaultPlanExecutor.java:129)
           [exec] 	at org.gradle.execution.plan.DefaultPlanExecutor$ExecutorWorker.execute(DefaultPlanExecutor.java:202)
           [exec] 	at org.gradle.execution.plan.DefaultPlanExecutor$ExecutorWorker.executeNextNode(DefaultPlanExecutor.java:193)
           [exec] 	at org.gradle.execution.plan.DefaultPlanExecutor$ExecutorWorker.run(DefaultPlanExecutor.java:129)
           [exec] 	at org.gradle.internal.concurrent.ExecutorPolicy$CatchAndRecordFailures.onExecute(ExecutorPolicy.java:64)
           [exec] 	at org.gradle.internal.concurrent.ManagedExecutorImpl$1.run(ManagedExecutorImpl.java:48)
           [exec] 	at org.gradle.internal.concurrent.ThreadFactoryImpl$ManagedThreadRunnable.run(ThreadFactoryImpl.java:56)
           [exec] Caused by: org.gradle.api.internal.artifacts.ivyservice.DefaultLenientConfiguration$ArtifactResolveException: Could not resolve all files for configuration ':private:apps:osb-koroneiki:osb-koroneiki-root:osb-koroneiki-root-api:compileClasspath'.
           [exec] 	at org.gradle.api.internal.artifacts.configurations.DefaultConfiguration.rethrowFailure(DefaultConfiguration.java:1258)
           [exec] 	at org.gradle.api.internal.artifacts.configurations.DefaultConfiguration.access$2200(DefaultConfiguration.java:139)
           [exec] 	at org.gradle.api.internal.artifacts.configurations.DefaultConfiguration$ConfigurationFileCollection.getFiles(DefaultConfiguration.java:1233)
           [exec] 	at org.gradle.api.internal.file.AbstractFileCollection.iterator(AbstractFileCollection.java:75)
           [exec] 	at org.gradle.api.internal.artifacts.configurations.DefaultConfiguration.iterator(DefaultConfiguration.java:486)
           [exec] 	at org.gradle.internal.fingerprint.impl.DefaultFileCollectionSnapshotter$FileCollectionLeafVisitorImpl.visitCollection(DefaultFileCollectionSnapshotter.java:60)
           [exec] 	at org.gradle.api.internal.file.AbstractFileCollection.visitLeafCollections(AbstractFileCollection.java:262)
           [exec] 	at org.gradle.api.internal.file.CompositeFileCollection.visitLeafCollections(CompositeFileCollection.java:205)
           [exec] 	at org.gradle.internal.fingerprint.impl.DefaultFileCollectionSnapshotter.snapshot(DefaultFileCollectionSnapshotter.java:50)
           [exec] 	at org.gradle.internal.fingerprint.impl.AbstractFileCollectionFingerprinter.fingerprint(AbstractFileCollectionFingerprinter.java:46)
           [exec] 	at org.gradle.api.internal.tasks.execution.ExecuteActionsTaskExecuter$TaskExecution.lambda$visitInputFileProperties$0(ExecuteActionsTaskExecuter.java:283)
           [exec] 	at org.gradle.internal.execution.steps.CaptureStateBeforeExecutionStep.lambda$fingerprintInputFiles$3(CaptureStateBeforeExecutionStep.java:154)
           [exec] 	at org.gradle.api.internal.tasks.execution.ExecuteActionsTaskExecuter$TaskExecution.visitInputFileProperties(ExecuteActionsTaskExecuter.java:281)
           [exec] 	at org.gradle.internal.execution.steps.CaptureStateBeforeExecutionStep.fingerprintInputFiles(CaptureStateBeforeExecutionStep.java:150)
           [exec] 	at org.gradle.internal.execution.steps.CaptureStateBeforeExecutionStep.createExecutionState(CaptureStateBeforeExecutionStep.java:114)
           [exec] 	at org.gradle.internal.execution.steps.CaptureStateBeforeExecutionStep.execute(CaptureStateBeforeExecutionStep.java:67)
           [exec] 	at org.gradle.internal.execution.steps.CaptureStateBeforeExecutionStep.execute(CaptureStateBeforeExecutionStep.java:47)
           [exec] 	at org.gradle.internal.execution.impl.DefaultWorkExecutor.execute(DefaultWorkExecutor.java:33)
           [exec] 	at org.gradle.api.internal.tasks.execution.ExecuteActionsTaskExecuter.execute(ExecuteActionsTaskExecuter.java:140)
           [exec] 	at org.gradle.api.internal.tasks.execution.ValidatingTaskExecuter.execute(ValidatingTaskExecuter.java:62)
           [exec] 	at org.gradle.api.internal.tasks.execution.SkipEmptySourceFilesTaskExecuter.execute(SkipEmptySourceFilesTaskExecuter.java:108)
           [exec] 	at org.gradle.api.internal.tasks.execution.ResolveBeforeExecutionOutputsTaskExecuter.execute(ResolveBeforeExecutionOutputsTaskExecuter.java:67)
           [exec] 	at org.gradle.api.internal.tasks.execution.ResolveAfterPreviousExecutionStateTaskExecuter.execute(ResolveAfterPreviousExecutionStateTaskExecuter.java:46)
           [exec] 	at org.gradle.api.internal.tasks.execution.CleanupStaleOutputsExecuter.execute(CleanupStaleOutputsExecuter.java:94)
           [exec] 	at org.gradle.api.internal.tasks.execution.FinalizePropertiesTaskExecuter.execute(FinalizePropertiesTaskExecuter.java:46)
           [exec] 	at org.gradle.api.internal.tasks.execution.ResolveTaskExecutionModeExecuter.execute(ResolveTaskExecutionModeExecuter.java:95)
           [exec] 	at org.gradle.api.internal.tasks.execution.SkipTaskWithNoActionsExecuter.execute(SkipTaskWithNoActionsExecuter.java:57)
           [exec] 	at org.gradle.api.internal.tasks.execution.SkipOnlyIfTaskExecuter.execute(SkipOnlyIfTaskExecuter.java:56)
           [exec] 	at org.gradle.api.internal.tasks.execution.CatchExceptionTaskExecuter.execute(CatchExceptionTaskExecuter.java:36)
           [exec] 	... 24 more
           [exec] Caused by: org.gradle.internal.resolve.ArtifactResolveException: Could not download com.liferay.portal.kernel.jar (com.liferay.portal:com.liferay.portal.kernel:4.0.0)
           [exec] 	at org.gradle.api.internal.artifacts.repositories.resolver.ExternalResourceResolver$RemoteRepositoryAccess.resolveArtifact(ExternalResourceResolver.java:490)
           [exec] 	at org.gradle.api.internal.artifacts.ivyservice.ivyresolve.CachingModuleComponentRepository$ResolveAndCacheRepositoryAccess.resolveArtifact(CachingModuleComponentRepository.java:421)
           [exec] 	at org.gradle.api.internal.artifacts.ivyservice.ivyresolve.ErrorHandlingModuleComponentRepository$ErrorHandlingModuleComponentRepositoryAccess.lambda$resolveArtifact$15(ErrorHandlingModuleComponentRepository.java:180)
           [exec] 	at org.gradle.api.internal.artifacts.ivyservice.ivyresolve.ErrorHandlingModuleComponentRepository$ErrorHandlingModuleComponentRepositoryAccess.tryResolveAndMaybeBlacklist(ErrorHandlingModuleComponentRepository.java:236)
           [exec] 	at org.gradle.api.internal.artifacts.ivyservice.ivyresolve.ErrorHandlingModuleComponentRepository$ErrorHandlingModuleComponentRepositoryAccess.performOperationWithRetries(ErrorHandlingModuleComponentRepository.java:202)
           [exec] 	at org.gradle.api.internal.artifacts.ivyservice.ivyresolve.ErrorHandlingModuleComponentRepository$ErrorHandlingModuleComponentRepositoryAccess.resolveArtifact(ErrorHandlingModuleComponentRepository.java:178)
           [exec] 	at org.gradle.api.internal.artifacts.ivyservice.ivyresolve.RepositoryChainArtifactResolver.resolveArtifact(RepositoryChainArtifactResolver.java:100)
           [exec] 	at org.gradle.api.internal.artifacts.ivyservice.resolveengine.artifact.DefaultArtifactSet$LazyArtifactSource.create(DefaultArtifactSet.java:184)
           [exec] 	at org.gradle.api.internal.artifacts.ivyservice.resolveengine.artifact.DefaultArtifactSet$LazyArtifactSource.create(DefaultArtifactSet.java:170)
           [exec] 	at org.gradle.api.internal.artifacts.DefaultResolvedArtifact.getFile(DefaultResolvedArtifact.java:174)
           [exec] 	at org.gradle.api.internal.artifacts.ivyservice.resolveengine.artifact.ArtifactBackedResolvedVariant$DownloadArtifactFile.run(ArtifactBackedResolvedVariant.java:146)
           [exec] 	at org.gradle.internal.operations.DefaultBuildOperationExecutor$RunnableBuildOperationWorker.execute(DefaultBuildOperationExecutor.java:402)
           [exec] 	at org.gradle.internal.operations.DefaultBuildOperationExecutor$RunnableBuildOperationWorker.execute(DefaultBuildOperationExecutor.java:394)
           [exec] 	at org.gradle.internal.operations.DefaultBuildOperationExecutor$1.execute(DefaultBuildOperationExecutor.java:165)
           [exec] 	at org.gradle.internal.operations.DefaultBuildOperationExecutor.execute(DefaultBuildOperationExecutor.java:250)
           [exec] 	at org.gradle.internal.operations.DefaultBuildOperationExecutor.execute(DefaultBuildOperationExecutor.java:158)
           [exec] 	at org.gradle.internal.operations.DefaultBuildOperationExecutor.access$1500(DefaultBuildOperationExecutor.java:49)
           [exec] 	at org.gradle.internal.operations.DefaultBuildOperationExecutor$ParentPreservingQueueWorker.execute(DefaultBuildOperationExecutor.java:444)
           [exec] 	at org.gradle.internal.operations.DefaultBuildOperationQueue$WorkerRunnable.runOperation(DefaultBuildOperationQueue.java:231)
           [exec] 	at org.gradle.internal.operations.DefaultBuildOperationQueue$WorkerRunnable.access$600(DefaultBuildOperationQueue.java:173)
           [exec] 	at org.gradle.internal.operations.DefaultBuildOperationQueue$WorkerRunnable$1.create(DefaultBuildOperationQueue.java:210)
           [exec] 	at org.gradle.internal.operations.DefaultBuildOperationQueue$WorkerRunnable$1.create(DefaultBuildOperationQueue.java:204)
           [exec] 	at org.gradle.internal.work.DefaultWorkerLeaseService.withLocks(DefaultWorkerLeaseService.java:189)
           [exec] 	at org.gradle.internal.operations.DefaultBuildOperationQueue$WorkerRunnable.runBatch(DefaultBuildOperationQueue.java:204)
           [exec] 	at org.gradle.internal.operations.DefaultBuildOperationQueue$WorkerRunnable.run(DefaultBuildOperationQueue.java:178)
           [exec] 	at org.gradle.internal.operations.DefaultBuildOperationQueue.waitForCompletion(DefaultBuildOperationQueue.java:117)
           [exec] 	at org.gradle.internal.operations.DefaultBuildOperationExecutor.executeInParallel(DefaultBuildOperationExecutor.java:144)
           [exec] 	at org.gradle.internal.operations.DefaultBuildOperationExecutor.runAll(DefaultBuildOperationExecutor.java:117)
           [exec] 	at org.gradle.internal.operations.DelegatingBuildOperationExecutor.runAll(DelegatingBuildOperationExecutor.java:46)
           [exec] 	at org.gradle.api.internal.artifacts.ivyservice.resolveengine.artifact.ParallelResolveArtifactSet$VisitingSet.visit(ParallelResolveArtifactSet.java:62)
           [exec] 	at org.gradle.api.internal.artifacts.ivyservice.DefaultLenientConfiguration.visitArtifacts(DefaultLenientConfiguration.java:261)
           [exec] 	at org.gradle.api.internal.artifacts.ivyservice.DefaultLenientConfiguration.access$500(DefaultLenientConfiguration.java:69)
           [exec] 	at org.gradle.api.internal.artifacts.ivyservice.DefaultLenientConfiguration$2.run(DefaultLenientConfiguration.java:236)
           [exec] 	at org.gradle.internal.operations.DefaultBuildOperationExecutor$RunnableBuildOperationWorker.execute(DefaultBuildOperationExecutor.java:402)
           [exec] 	at org.gradle.internal.operations.DefaultBuildOperationExecutor$RunnableBuildOperationWorker.execute(DefaultBuildOperationExecutor.java:394)
           [exec] 	at org.gradle.internal.operations.DefaultBuildOperationExecutor$1.execute(DefaultBuildOperationExecutor.java:165)
           [exec] 	at org.gradle.internal.operations.DefaultBuildOperationExecutor.execute(DefaultBuildOperationExecutor.java:250)
           [exec] 	at org.gradle.internal.operations.DefaultBuildOperationExecutor.execute(DefaultBuildOperationExecutor.java:158)
           [exec] 	at org.gradle.internal.operations.DefaultBuildOperationExecutor.run(DefaultBuildOperationExecutor.java:92)
           [exec] 	at org.gradle.internal.operations.DelegatingBuildOperationExecutor.run(DelegatingBuildOperationExecutor.java:31)
           [exec] 	at org.gradle.api.internal.artifacts.ivyservice.DefaultLenientConfiguration.visitArtifactsWithBuildOperation(DefaultLenientConfiguration.java:233)
           [exec] 	at org.gradle.api.internal.artifacts.ivyservice.DefaultLenientConfiguration.access$200(DefaultLenientConfiguration.java:69)
           [exec] 	at org.gradle.api.internal.artifacts.ivyservice.DefaultLenientConfiguration$1.visitArtifacts(DefaultLenientConfiguration.java:133)
           [exec] 	at org.gradle.api.internal.artifacts.configurations.DefaultConfiguration$ConfigurationFileCollection.getFiles(DefaultConfiguration.java:1230)
           [exec] 	... 50 more
           [exec] Caused by: org.gradle.api.resources.ResourceException: Could not get resource 'http://repository-cdn.liferay.com/nexus/content/groups/public/com/liferay/portal/com.liferay.portal.kernel/4.0.0/com.liferay.portal.kernel-4.0.0.jar'.
           [exec] 	at org.gradle.internal.resource.ResourceExceptions.failure(ResourceExceptions.java:74)
           [exec] 	at org.gradle.internal.resource.ResourceExceptions.getFailed(ResourceExceptions.java:57)
           [exec] 	at org.gradle.internal.resource.transfer.DefaultCacheAwareExternalResourceAccessor.copyToCache(DefaultCacheAwareExternalResourceAccessor.java:203)
           [exec] 	at org.gradle.internal.resource.transfer.DefaultCacheAwareExternalResourceAccessor.access$300(DefaultCacheAwareExternalResourceAccessor.java:55)
           [exec] 	at org.gradle.internal.resource.transfer.DefaultCacheAwareExternalResourceAccessor$1.get(DefaultCacheAwareExternalResourceAccessor.java:90)
           [exec] 	at org.gradle.internal.resource.transfer.DefaultCacheAwareExternalResourceAccessor$1.get(DefaultCacheAwareExternalResourceAccessor.java:82)
           [exec] 	at org.gradle.cache.internal.ProducerGuard$AdaptiveProducerGuard.guardByKey(ProducerGuard.java:97)
           [exec] 	at org.gradle.internal.resource.transfer.DefaultCacheAwareExternalResourceAccessor.getResource(DefaultCacheAwareExternalResourceAccessor.java:82)
           [exec] 	at org.gradle.api.internal.artifacts.repositories.resolver.DefaultExternalResourceArtifactResolver.downloadByCoords(DefaultExternalResourceArtifactResolver.java:135)
           [exec] 	at org.gradle.api.internal.artifacts.repositories.resolver.DefaultExternalResourceArtifactResolver.downloadStaticResource(DefaultExternalResourceArtifactResolver.java:99)
           [exec] 	at org.gradle.api.internal.artifacts.repositories.resolver.DefaultExternalResourceArtifactResolver.resolveArtifact(DefaultExternalResourceArtifactResolver.java:67)
           [exec] 	at org.gradle.api.internal.artifacts.repositories.resolver.ExternalResourceResolver$RemoteRepositoryAccess.resolveArtifact(ExternalResourceResolver.java:483)
           [exec] 	... 93 more
           [exec] Caused by: org.gradle.internal.resource.transport.http.HttpRequestException: Could not GET 'http://repository-cdn.liferay.com/nexus/content/groups/public/com/liferay/portal/com.liferay.portal.kernel/4.0.0/com.liferay.portal.kernel-4.0.0.jar'.
           [exec] 	at org.gradle.internal.resource.transport.http.HttpClientHelper.performRequest(HttpClientHelper.java:93)
           [exec] 	at org.gradle.internal.resource.transport.http.HttpClientHelper.performRawGet(HttpClientHelper.java:76)
           [exec] 	at org.gradle.internal.resource.transport.http.HttpClientHelper.performGet(HttpClientHelper.java:80)
           [exec] 	at org.gradle.internal.resource.transport.http.HttpResourceAccessor.openResource(HttpResourceAccessor.java:43)
           [exec] 	at org.gradle.internal.resource.transport.http.LiferayHttpResourceAccessor.openResource(LiferayHttpResourceAccessor.java:121)
           [exec] 	at org.gradle.internal.resource.transport.http.LiferayHttpResourceAccessor.openResource(LiferayHttpResourceAccessor.java:60)
           [exec] 	at org.gradle.internal.resource.transfer.DefaultExternalResourceConnector.openResource(DefaultExternalResourceConnector.java:56)
           [exec] 	at org.gradle.internal.resource.transfer.ProgressLoggingExternalResourceAccessor.openResource(ProgressLoggingExternalResourceAccessor.java:38)
           [exec] 	at org.gradle.internal.resource.transfer.AccessorBackedExternalResource.withContentIfPresent(AccessorBackedExternalResource.java:130)
           [exec] 	at org.gradle.internal.resource.BuildOperationFiringExternalResourceDecorator$11.call(BuildOperationFiringExternalResourceDecorator.java:237)
           [exec] 	at org.gradle.internal.resource.BuildOperationFiringExternalResourceDecorator$11.call(BuildOperationFiringExternalResourceDecorator.java:229)
           [exec] 	at org.gradle.internal.operations.DefaultBuildOperationExecutor$CallableBuildOperationWorker.execute(DefaultBuildOperationExecutor.java:416)
           [exec] 	at org.gradle.internal.operations.DefaultBuildOperationExecutor$CallableBuildOperationWorker.execute(DefaultBuildOperationExecutor.java:406)
           [exec] 	at org.gradle.internal.operations.DefaultBuildOperationExecutor$1.execute(DefaultBuildOperationExecutor.java:165)
           [exec] 	at org.gradle.internal.operations.DefaultBuildOperationExecutor.execute(DefaultBuildOperationExecutor.java:250)
           [exec] 	at org.gradle.internal.operations.DefaultBuildOperationExecutor.execute(DefaultBuildOperationExecutor.java:158)
           [exec] 	at org.gradle.internal.operations.DefaultBuildOperationExecutor.call(DefaultBuildOperationExecutor.java:102)
           [exec] 	at org.gradle.internal.operations.DelegatingBuildOperationExecutor.call(DelegatingBuildOperationExecutor.java:36)
           [exec] 	at org.gradle.internal.resource.BuildOperationFiringExternalResourceDecorator.withContentIfPresent(BuildOperationFiringExternalResourceDecorator.java:229)
           [exec] 	at org.gradle.internal.resource.transfer.DefaultCacheAwareExternalResourceAccessor.copyToCache(DefaultCacheAwareExternalResourceAccessor.java:201)
           [exec] 	... 102 more
           [exec] Caused by: java.net.SocketTimeoutException: Read timed out
           [exec] 	at org.apache.http.impl.io.SessionInputBufferImpl.streamRead(SessionInputBufferImpl.java:137)
           [exec] 	at org.apache.http.impl.io.SessionInputBufferImpl.fillBuffer(SessionInputBufferImpl.java:153)
           [exec] 	at org.apache.http.impl.io.SessionInputBufferImpl.readLine(SessionInputBufferImpl.java:282)
           [exec] 	at org.apache.http.impl.conn.DefaultHttpResponseParser.parseHead(DefaultHttpResponseParser.java:138)
           [exec] 	at org.apache.http.impl.conn.DefaultHttpResponseParser.parseHead(DefaultHttpResponseParser.java:56)
           [exec] 	at org.apache.http.impl.io.AbstractMessageParser.parse(AbstractMessageParser.java:259)
           [exec] 	at org.apache.http.impl.DefaultBHttpClientConnection.receiveResponseHeader(DefaultBHttpClientConnection.java:163)
           [exec] 	at org.apache.http.impl.conn.CPoolProxy.receiveResponseHeader(CPoolProxy.java:165)
           [exec] 	at org.apache.http.protocol.HttpRequestExecutor.doReceiveResponse(HttpRequestExecutor.java:273)
           [exec] 	at org.apache.http.protocol.HttpRequestExecutor.execute(HttpRequestExecutor.java:125)
           [exec] 	at org.apache.http.impl.execchain.MainClientExec.execute(MainClientExec.java:272)
           [exec] 	at org.apache.http.impl.execchain.ProtocolExec.execute(ProtocolExec.java:185)
           [exec] 	at org.apache.http.impl.execchain.RetryExec.execute(RetryExec.java:89)
           [exec] 	at org.apache.http.impl.execchain.RedirectExec.execute(RedirectExec.java:110)
           [exec] 	at org.apache.http.impl.client.InternalHttpClient.doExecute(InternalHttpClient.java:185)
           [exec] 	at org.apache.http.impl.client.CloseableHttpClient.execute(CloseableHttpClient.java:83)
           [exec] 	at org.gradle.internal.resource.transport.http.HttpClientHelper.performHttpRequest(HttpClientHelper.java:132)
           [exec] 	at org.gradle.internal.resource.transport.http.HttpClientHelper.performHttpRequest(HttpClientHelper.java:109)
           [exec] 	at org.gradle.internal.resource.transport.http.HttpClientHelper.executeGetOrHead(HttpClientHelper.java:98)
           [exec] 	at org.gradle.internal.resource.transport.http.HttpClientHelper.performRequest(HttpClientHelper.java:89)
           [exec] 	... 121 more
           [exec] 
           [exec] 
           [exec] * Get more help at https://help.gradle.org
      

        Attachments

          Activity

            People

            Assignee:
            support-lep@liferay.com SE Support
            Reporter:
            michael.eguina Michael Eguina
            Participants of an Issue:
            Recent user:
            Kyle Miho
            Votes:
            0 Vote for this issue
            Watchers:
            0 Start watching this issue

              Dates

              Created:
              Updated:
              Resolved:
              Days since last comment:
              38 weeks, 4 days ago

                Packages

                Version Package