Uploaded image for project: 'PUBLIC - Liferay Portal Community Edition'
  1. PUBLIC - Liferay Portal Community Edition
  2. LPS-106611

Execution failed for task ':dxp:apps:saml:saml-persistence-test:compileTestIntegrationJava'

    Details

    • Type: Regression Bug
    • Status: Closed
    • Resolution: No Longer Reproducible
    • Affects Version/s: 7.1.X
    • Fix Version/s: 7.1.X
    • Labels:
      None
    • Fix Priority:
      3

      Description

      Occurred on test-portal-app-release job:

      [exec] FAILURE: Build failed with an exception.
           [exec] 
           [exec] * What went wrong:
           [exec] 
           [exec] Execution failed for task ':dxp:apps:saml:saml-persistence-test:compileTestIntegrationJava'.
           [exec] > Could not resolve all files for configuration ':dxp:apps:saml:saml-persistence-test:portalTest'.
           [exec]    > Could not find com.liferay.portal:com.liferay.portal.test:5.4.2-SNAPSHOT.
           [exec]      Searched in the following locations:
           [exec]        - file:/opt/dev/projects/github/liferay-portal-7.1.x-private/.m2/com/liferay/portal/com.liferay.portal.test/5.4.2-SNAPSHOT/maven-metadata.xml
           [exec]        - file:/opt/dev/projects/github/liferay-portal-7.1.x-private/.m2/com/liferay/portal/com.liferay.portal.test/5.4.2-SNAPSHOT/com.liferay.portal.test-5.4.2-SNAPSHOT.pom
           [exec]        - file:/opt/dev/projects/github/liferay-portal-7.1.x-private/.m2/com/liferay/portal/com.liferay.portal.test/5.4.2-SNAPSHOT/com.liferay.portal.test-5.4.2-SNAPSHOT.jar
           [exec]        - http://repository-cdn.liferay.com/nexus/content/groups/public/com/liferay/portal/com.liferay.portal.test/5.4.2-SNAPSHOT/maven-metadata.xml
           [exec]        - http://repository-cdn.liferay.com/nexus/content/groups/public/com/liferay/portal/com.liferay.portal.test/5.4.2-SNAPSHOT/com.liferay.portal.test-5.4.2-SNAPSHOT.pom
           [exec]        - http://repository-cdn.liferay.com/nexus/content/groups/public/com/liferay/portal/com.liferay.portal.test/5.4.2-SNAPSHOT/com.liferay.portal.test-5.4.2-SNAPSHOT.jar
           [exec]        - http://repository-cdn.liferay.com/nexus/service/local/repo_groups/private/content/com/liferay/portal/com.liferay.portal.test/5.4.2-SNAPSHOT/maven-metadata.xml
           [exec]        - http://repository-cdn.liferay.com/nexus/service/local/repo_groups/private/content/com/liferay/portal/com.liferay.portal.test/5.4.2-SNAPSHOT/com.liferay.portal.test-5.4.2-SNAPSHOT.pom
           [exec]        - http://repository-cdn.liferay.com/nexus/service/local/repo_groups/private/content/com/liferay/portal/com.liferay.portal.test/5.4.2-SNAPSHOT/com.liferay.portal.test-5.4.2-SNAPSHOT.jar
           [exec]      Required by:
           [exec]          project :dxp:apps:saml:saml-persistence-test
           [exec]    > Could not find com.liferay.portal:com.liferay.portal.test.integration:5.2.4-SNAPSHOT.
           [exec]      Searched in the following locations:
           [exec]        - file:/opt/dev/projects/github/liferay-portal-7.1.x-private/.m2/com/liferay/portal/com.liferay.portal.test.integration/5.2.4-SNAPSHOT/maven-metadata.xml
           [exec]        - file:/opt/dev/projects/github/liferay-portal-7.1.x-private/.m2/com/liferay/portal/com.liferay.portal.test.integration/5.2.4-SNAPSHOT/com.liferay.portal.test.integration-5.2.4-SNAPSHOT.pom
           [exec]        - file:/opt/dev/projects/github/liferay-portal-7.1.x-private/.m2/com/liferay/portal/com.liferay.portal.test.integration/5.2.4-SNAPSHOT/com.liferay.portal.test.integration-5.2.4-SNAPSHOT.jar
           [exec]        - http://repository-cdn.liferay.com/nexus/content/groups/public/com/liferay/portal/com.liferay.portal.test.integration/5.2.4-SNAPSHOT/maven-metadata.xml
           [exec]        - http://repository-cdn.liferay.com/nexus/content/groups/public/com/liferay/portal/com.liferay.portal.test.integration/5.2.4-SNAPSHOT/com.liferay.portal.test.integration-5.2.4-SNAPSHOT.pom
           [exec]        - http://repository-cdn.liferay.com/nexus/content/groups/public/com/liferay/portal/com.liferay.portal.test.integration/5.2.4-SNAPSHOT/com.liferay.portal.test.integration-5.2.4-SNAPSHOT.jar
           [exec]        - http://repository-cdn.liferay.com/nexus/service/local/repo_groups/private/content/com/liferay/portal/com.liferay.portal.test.integration/5.2.4-SNAPSHOT/maven-metadata.xml
           [exec]        - http://repository-cdn.liferay.com/nexus/service/local/repo_groups/private/content/com/liferay/portal/com.liferay.portal.test.integration/5.2.4-SNAPSHOT/com.liferay.portal.test.integration-5.2.4-SNAPSHOT.pom
           [exec]        - http://repository-cdn.liferay.com/nexus/service/local/repo_groups/private/content/com/liferay/portal/com.liferay.portal.test.integration/5.2.4-SNAPSHOT/com.liferay.portal.test.integration-5.2.4-SNAPSHOT.jar
           [exec]      Required by:
           [exec]          project :dxp:apps:saml:saml-persistence-test
           [exec] 
           [exec] * Try:
           [exec] Run with --info or --debug option to get more log output. Run with --scan to get full insights.
           [exec] 
           [exec] * Exception is:
           [exec] org.gradle.api.tasks.TaskExecutionException: Execution failed for task ':dxp:apps:saml:saml-persistence-test:compileTestIntegrationJava'.
           [exec] 	at org.gradle.api.internal.tasks.execution.CatchExceptionTaskExecuter.execute(CatchExceptionTaskExecuter.java:38)
           [exec] 	at org.gradle.api.internal.tasks.execution.EventFiringTaskExecuter$1.executeTask(EventFiringTaskExecuter.java:77)
           [exec] 	at org.gradle.api.internal.tasks.execution.EventFiringTaskExecuter$1.call(EventFiringTaskExecuter.java:55)
           [exec] 	at org.gradle.api.internal.tasks.execution.EventFiringTaskExecuter$1.call(EventFiringTaskExecuter.java:52)
           [exec] 	at org.gradle.internal.operations.DefaultBuildOperationExecutor$CallableBuildOperationWorker.execute(DefaultBuildOperationExecutor.java:416)
           [exec] 	at org.gradle.internal.operations.DefaultBuildOperationExecutor$CallableBuildOperationWorker.execute(DefaultBuildOperationExecutor.java:406)
           [exec] 	at org.gradle.internal.operations.DefaultBuildOperationExecutor$1.execute(DefaultBuildOperationExecutor.java:165)
           [exec] 	at org.gradle.internal.operations.DefaultBuildOperationExecutor.execute(DefaultBuildOperationExecutor.java:250)
           [exec] 	at org.gradle.internal.operations.DefaultBuildOperationExecutor.execute(DefaultBuildOperationExecutor.java:158)
           [exec] 	at org.gradle.internal.operations.DefaultBuildOperationExecutor.call(DefaultBuildOperationExecutor.java:102)
           [exec] 	at org.gradle.internal.operations.DelegatingBuildOperationExecutor.call(DelegatingBuildOperationExecutor.java:36)
           [exec] 	at org.gradle.api.internal.tasks.execution.EventFiringTaskExecuter.execute(EventFiringTaskExecuter.java:52)
           [exec] 	at org.gradle.execution.plan.LocalTaskNodeExecutor.execute(LocalTaskNodeExecutor.java:43)
           [exec] 	at org.gradle.execution.taskgraph.DefaultTaskExecutionGraph$InvokeNodeExecutorsAction.execute(DefaultTaskExecutionGraph.java:355)
           [exec] 	at org.gradle.execution.taskgraph.DefaultTaskExecutionGraph$InvokeNodeExecutorsAction.execute(DefaultTaskExecutionGraph.java:343)
           [exec] 	at org.gradle.execution.taskgraph.DefaultTaskExecutionGraph$BuildOperationAwareExecutionAction.execute(DefaultTaskExecutionGraph.java:336)
           [exec] 	at org.gradle.execution.taskgraph.DefaultTaskExecutionGraph$BuildOperationAwareExecutionAction.execute(DefaultTaskExecutionGraph.java:322)
           [exec] 	at org.gradle.execution.plan.DefaultPlanExecutor$ExecutorWorker$1.execute(DefaultPlanExecutor.java:134)
           [exec] 	at org.gradle.execution.plan.DefaultPlanExecutor$ExecutorWorker$1.execute(DefaultPlanExecutor.java:129)
           [exec] 	at org.gradle.execution.plan.DefaultPlanExecutor$ExecutorWorker.execute(DefaultPlanExecutor.java:202)
           [exec] 	at org.gradle.execution.plan.DefaultPlanExecutor$ExecutorWorker.executeNextNode(DefaultPlanExecutor.java:193)
           [exec] 	at org.gradle.execution.plan.DefaultPlanExecutor$ExecutorWorker.run(DefaultPlanExecutor.java:129)
           [exec] 	at org.gradle.internal.concurrent.ExecutorPolicy$CatchAndRecordFailures.onExecute(ExecutorPolicy.java:64)
           [exec] 	at org.gradle.internal.concurrent.ManagedExecutorImpl$1.run(ManagedExecutorImpl.java:48)
           [exec] 	at org.gradle.internal.concurrent.ThreadFactoryImpl$ManagedThreadRunnable.run(ThreadFactoryImpl.java:56)
           [exec] Caused by: org.gradle.api.internal.artifacts.ivyservice.DefaultLenientConfiguration$ArtifactResolveException: Could not resolve all files for configuration ':dxp:apps:saml:saml-persistence-test:portalTest'.
           [exec] 	at org.gradle.api.internal.artifacts.configurations.DefaultConfiguration.rethrowFailure(DefaultConfiguration.java:1258)
           [exec] 	at org.gradle.api.internal.artifacts.configurations.DefaultConfiguration.access$2200(DefaultConfiguration.java:139)
           [exec] 	at org.gradle.api.internal.artifacts.configurations.DefaultConfiguration$ConfigurationFileCollection.getFiles(DefaultConfiguration.java:1233)
           [exec] 	at org.gradle.api.internal.file.AbstractFileCollection.iterator(AbstractFileCollection.java:75)
           [exec] 	at org.gradle.api.internal.artifacts.configurations.DefaultConfiguration.iterator(DefaultConfiguration.java:486)
           [exec] 	at org.gradle.internal.fingerprint.impl.DefaultFileCollectionSnapshotter$FileCollectionLeafVisitorImpl.visitCollection(DefaultFileCollectionSnapshotter.java:60)
           [exec] 	at org.gradle.api.internal.file.AbstractFileCollection.visitLeafCollections(AbstractFileCollection.java:262)
           [exec] 	at org.gradle.api.internal.file.CompositeFileCollection.visitLeafCollections(CompositeFileCollection.java:205)
           [exec] 	at org.gradle.internal.fingerprint.impl.DefaultFileCollectionSnapshotter.snapshot(DefaultFileCollectionSnapshotter.java:50)
           [exec] 	at org.gradle.internal.fingerprint.impl.AbstractFileCollectionFingerprinter.fingerprint(AbstractFileCollectionFingerprinter.java:46)
           [exec] 	at org.gradle.api.internal.tasks.execution.ExecuteActionsTaskExecuter$TaskExecution.lambda$visitInputFileProperties$0(ExecuteActionsTaskExecuter.java:283)
           [exec] 	at org.gradle.internal.execution.steps.CaptureStateBeforeExecutionStep.lambda$fingerprintInputFiles$3(CaptureStateBeforeExecutionStep.java:154)
           [exec] 	at org.gradle.api.internal.tasks.execution.ExecuteActionsTaskExecuter$TaskExecution.visitInputFileProperties(ExecuteActionsTaskExecuter.java:281)
           [exec] 	at org.gradle.internal.execution.steps.CaptureStateBeforeExecutionStep.fingerprintInputFiles(CaptureStateBeforeExecutionStep.java:150)
           [exec] 	at org.gradle.internal.execution.steps.CaptureStateBeforeExecutionStep.createExecutionState(CaptureStateBeforeExecutionStep.java:114)
           [exec] 	at org.gradle.internal.execution.steps.CaptureStateBeforeExecutionStep.execute(CaptureStateBeforeExecutionStep.java:67)
           [exec] 	at org.gradle.internal.execution.steps.CaptureStateBeforeExecutionStep.execute(CaptureStateBeforeExecutionStep.java:47)
           [exec] 	at org.gradle.internal.execution.impl.DefaultWorkExecutor.execute(DefaultWorkExecutor.java:33)
           [exec] 	at org.gradle.api.internal.tasks.execution.ExecuteActionsTaskExecuter.execute(ExecuteActionsTaskExecuter.java:140)
           [exec] 	at org.gradle.api.internal.tasks.execution.ValidatingTaskExecuter.execute(ValidatingTaskExecuter.java:62)
           [exec] 	at org.gradle.api.internal.tasks.execution.SkipEmptySourceFilesTaskExecuter.execute(SkipEmptySourceFilesTaskExecuter.java:108)
           [exec] 	at org.gradle.api.internal.tasks.execution.ResolveBeforeExecutionOutputsTaskExecuter.execute(ResolveBeforeExecutionOutputsTaskExecuter.java:67)
           [exec] 	at org.gradle.api.internal.tasks.execution.ResolveAfterPreviousExecutionStateTaskExecuter.execute(ResolveAfterPreviousExecutionStateTaskExecuter.java:46)
           [exec] 	at org.gradle.api.internal.tasks.execution.CleanupStaleOutputsExecuter.execute(CleanupStaleOutputsExecuter.java:94)
           [exec] 	at org.gradle.api.internal.tasks.execution.FinalizePropertiesTaskExecuter.execute(FinalizePropertiesTaskExecuter.java:46)
           [exec] 	at org.gradle.api.internal.tasks.execution.ResolveTaskExecutionModeExecuter.execute(ResolveTaskExecutionModeExecuter.java:95)
           [exec] 	at org.gradle.api.internal.tasks.execution.SkipTaskWithNoActionsExecuter.execute(SkipTaskWithNoActionsExecuter.java:57)
           [exec] 	at org.gradle.api.internal.tasks.execution.SkipOnlyIfTaskExecuter.execute(SkipOnlyIfTaskExecuter.java:56)
           [exec] 	at org.gradle.api.internal.tasks.execution.CatchExceptionTaskExecuter.execute(CatchExceptionTaskExecuter.java:36)
           [exec] 	... 24 more
           [exec] Caused by: org.gradle.internal.resolve.ModuleVersionNotFoundException: Could not find com.liferay.portal:com.liferay.portal.test:5.4.2-SNAPSHOT.
           [exec] Searched in the following locations:
           [exec]   - file:/opt/dev/projects/github/liferay-portal-7.1.x-private/.m2/com/liferay/portal/com.liferay.portal.test/5.4.2-SNAPSHOT/maven-metadata.xml
           [exec]   - file:/opt/dev/projects/github/liferay-portal-7.1.x-private/.m2/com/liferay/portal/com.liferay.portal.test/5.4.2-SNAPSHOT/com.liferay.portal.test-5.4.2-SNAPSHOT.pom
           [exec]   - file:/opt/dev/projects/github/liferay-portal-7.1.x-private/.m2/com/liferay/portal/com.liferay.portal.test/5.4.2-SNAPSHOT/com.liferay.portal.test-5.4.2-SNAPSHOT.jar
           [exec]   - http://repository-cdn.liferay.com/nexus/content/groups/public/com/liferay/portal/com.liferay.portal.test/5.4.2-SNAPSHOT/maven-metadata.xml
           [exec]   - http://repository-cdn.liferay.com/nexus/content/groups/public/com/liferay/portal/com.liferay.portal.test/5.4.2-SNAPSHOT/com.liferay.portal.test-5.4.2-SNAPSHOT.pom
           [exec]   - http://repository-cdn.liferay.com/nexus/content/groups/public/com/liferay/portal/com.liferay.portal.test/5.4.2-SNAPSHOT/com.liferay.portal.test-5.4.2-SNAPSHOT.jar
           [exec]   - http://repository-cdn.liferay.com/nexus/service/local/repo_groups/private/content/com/liferay/portal/com.liferay.portal.test/5.4.2-SNAPSHOT/maven-metadata.xml
           [exec]   - http://repository-cdn.liferay.com/nexus/service/local/repo_groups/private/content/com/liferay/portal/com.liferay.portal.test/5.4.2-SNAPSHOT/com.liferay.portal.test-5.4.2-SNAPSHOT.pom
           [exec]   - http://repository-cdn.liferay.com/nexus/service/local/repo_groups/private/content/com/liferay/portal/com.liferay.portal.test/5.4.2-SNAPSHOT/com.liferay.portal.test-5.4.2-SNAPSHOT.jar
           [exec] Required by:
           [exec]     project :dxp:apps:saml:saml-persistence-test
           [exec] 
           [exec] 
           [exec] * Get more help at https://help.gradle.org
           [exec] 
           [exec] BUILD FAILED in 1m 15s

      Build parameters please see https://test-1-1.liferay.com/job/test-portal-app-release/268/parameters/

      Full console log:

      https://testray.liferay.com/reports/production/logs/test-1-1/1577178914654/test-portal-app-release/264/functional-bundle-tomcat-hypersonic20-jdk8/0/10/jenkins-console.txt.gz https://testray.liferay.com/reports/production/logs/test-1-1/1578370277384/test-portal-app-release/268/functional-bundle-tomcat-mysql57-jdk8/0/10/jenkins-console.txt.gz

        Attachments

          Activity

            People

            Assignee:
            della.wang Della Wang (Inactive)
            Reporter:
            della.wang Della Wang (Inactive)
            Participants of an Issue:
            Recent user:
            Della Wang (Inactive)
            Votes:
            0 Vote for this issue
            Watchers:
            0 Start watching this issue

              Dates

              Created:
              Updated:
              Resolved:
              Days since last comment:
              1 year, 7 weeks, 5 days ago

                Packages

                Version Package
                7.1.X