Uploaded image for project: 'PUBLIC - Liferay Portal Community Edition'
  1. PUBLIC - Liferay Portal Community Edition
  2. LPS-106876

Some integration cases failed due to HTTP 403 Forbidden

    Description

    Occurred on master acceptance CI tester:

    [exec] com.liferay.oauth2.provider.client.test.RefreshTokenTest > test FAILED
     [exec] javax.ws.rs.ForbiddenException: HTTP 403 Forbidden
     [exec] at sun.reflect.NativeConstructorAccessorImpl.newInstance0(Native Method)
     [exec] at sun.reflect.NativeConstructorAccessorImpl.newInstance(NativeConstructorAccessorImpl.java:62)
     [exec] at sun.reflect.DelegatingConstructorAccessorImpl.newInstance(DelegatingConstructorAccessorImpl.java:45)
     [exec] at java.lang.reflect.Constructor.newInstance(Constructor.java:423)
     [exec] at org.apache.cxf.jaxrs.client.AbstractClient.convertToWebApplicationException(AbstractClient.java:522)
     [exec] at org.apache.cxf.jaxrs.client.WebClient.doInvoke(WebClient.java:904)
     [exec] at org.apache.cxf.jaxrs.client.WebClient.doInvoke(WebClient.java:866)
     [exec] at org.apache.cxf.jaxrs.client.WebClient.invoke(WebClient.java:431)
     [exec] at org.apache.cxf.jaxrs.client.SyncInvokerImpl.method(SyncInvokerImpl.java:135)
     [exec] at org.apache.cxf.jaxrs.client.SyncInvokerImpl.get(SyncInvokerImpl.java:55)
     [exec] at org.apache.cxf.jaxrs.client.spec.InvocationBuilderImpl.get(InvocationBuilderImpl.java:93)
     [exec] at com.liferay.oauth2.provider.client.test.RefreshTokenTest.test(RefreshTokenTest.java:77)
     [exec] at sun.reflect.NativeMethodAccessorImpl.invoke0(Native Method)
     [exec] at sun.reflect.NativeMethodAccessorImpl.invoke(NativeMethodAccessorImpl.java:62)
     [exec] at sun.reflect.DelegatingMethodAccessorImpl.invoke(DelegatingMethodAccessorImpl.java:43)
     [exec] at java.lang.reflect.Method.invoke(Method.java:498)
     [exec] at com.liferay.arquillian.extension.junit.bridge.server.TestExecutorRunnable$2.evaluate(TestExecutorRunnable.java:234)
     [exec] at org.junit.internal.runners.statements.RunBefores.evaluate(RunBefores.java:26)
     [exec] at org.junit.internal.runners.statements.RunAfters.evaluate(RunAfters.java:27)
     [exec] at com.liferay.portal.kernel.test.rule.AbstractTestRule$2.evaluate(AbstractTestRule.java:99)
     [exec] at com.liferay.portal.kernel.test.rule.AbstractTestRule$2.evaluate(AbstractTestRule.java:99)
     [exec] at com.liferay.portal.kernel.test.rule.AbstractTestRule$2.evaluate(AbstractTestRule.java:99)
     [exec] at com.liferay.portal.kernel.test.rule.AbstractTestRule$2.evaluate(AbstractTestRule.java:99)
     [exec] at com.liferay.portal.kernel.test.rule.AbstractTestRule$2.evaluate(AbstractTestRule.java:99)
     [exec] at com.liferay.portal.kernel.test.rule.TimeoutTestRule$1.evaluate(TimeoutTestRule.java:89)
     [exec] at org.junit.rules.RunRules.evaluate(RunRules.java:20)
     [exec] at com.liferay.arquillian.extension.junit.bridge.server.TestExecutorRunnable$1.evaluate(TestExecutorRunnable.java:143)
     [exec] at org.junit.internal.runners.statements.RunBefores.evaluate(RunBefores.java:26)
     [exec] at org.junit.internal.runners.statements.RunAfters.evaluate(RunAfters.java:27)
     [exec] at com.liferay.portal.kernel.test.rule.AbstractTestRule$1.evaluate(AbstractTestRule.java:59)
     [exec] at com.liferay.portal.kernel.test.rule.AbstractTestRule$1.evaluate(AbstractTestRule.java:59)
     [exec] at com.liferay.portal.kernel.test.rule.AbstractTestRule$1.evaluate(AbstractTestRule.java:59)
     [exec] at com.liferay.portal.kernel.test.rule.AbstractTestRule$1.evaluate(AbstractTestRule.java:59)
     [exec] at com.liferay.portal.kernel.test.rule.AbstractTestRule$1.evaluate(AbstractTestRule.java:59)
     [exec] at com.liferay.portal.kernel.test.rule.AbstractTestRule$1.evaluate(AbstractTestRule.java:59)
     [exec] at com.liferay.portal.kernel.test.rule.AbstractTestRule$1.evaluate(AbstractTestRule.java:59)
     [exec] at com.liferay.portal.kernel.test.rule.AbstractTestRule$1.evaluate(AbstractTestRule.java:59)
     [exec] at org.junit.rules.RunRules.evaluate(RunRules.java:20)
     [exec] at com.liferay.arquillian.extension.junit.bridge.server.TestExecutorRunnable._execute(TestExecutorRunnable.java:181)
     [exec] at com.liferay.arquillian.extension.junit.bridge.server.TestExecutorRunnable.run(TestExecutorRunnable.java:95)
     [exec] at java.lang.Thread.run(Thread.java:745)
     [exec] 
     [exec] com.liferay.oauth2.provider.client.test.ScopeFinderTest > testUnavailableAssignedScopeAliases STARTED
     [exec] 
     [exec] com.liferay.oauth2.provider.client.test.ScopeFinderTest > testUnavailableAssignedScopeAliases FAILED
     [exec] javax.ws.rs.ForbiddenException: HTTP 403 Forbidden
     [exec] at sun.reflect.NativeConstructorAccessorImpl.newInstance0(Native Method)
     [exec] at sun.reflect.NativeConstructorAccessorImpl.newInstance(NativeConstructorAccessorImpl.java:62)
     [exec] at sun.reflect.DelegatingConstructorAccessorImpl.newInstance(DelegatingConstructorAccessorImpl.java:45)
     [exec] at java.lang.reflect.Constructor.newInstance(Constructor.java:423)
     [exec] at org.apache.cxf.jaxrs.client.AbstractClient.convertToWebApplicationException(AbstractClient.java:522)
     [exec] at org.apache.cxf.jaxrs.client.WebClient.doInvoke(WebClient.java:904)
     [exec] at org.apache.cxf.jaxrs.client.WebClient.doInvoke(WebClient.java:866)
     [exec] at org.apache.cxf.jaxrs.client.WebClient.invoke(WebClient.java:431)
     [exec] at org.apache.cxf.jaxrs.client.SyncInvokerImpl.method(SyncInvokerImpl.java:135)
     [exec] at org.apache.cxf.jaxrs.client.SyncInvokerImpl.get(SyncInvokerImpl.java:55)
     [exec] at org.apache.cxf.jaxrs.client.spec.InvocationBuilderImpl.get(InvocationBuilderImpl.java:93)
     [exec] at com.liferay.oauth2.provider.client.test.ScopeFinderTest.testUnavailableAssignedScopeAliases(ScopeFinderTest.java:67)
     [exec] at sun.reflect.NativeMethodAccessorImpl.invoke0(Native Method)
     [exec] at sun.reflect.NativeMethodAccessorImpl.invoke(NativeMethodAccessorImpl.java:62)
     [exec] at sun.reflect.DelegatingMethodAccessorImpl.invoke(DelegatingMethodAccessorImpl.java:43)
     [exec] at java.lang.reflect.Method.invoke(Method.java:498)
     [exec] at com.liferay.arquillian.extension.junit.bridge.server.TestExecutorRunnable$2.evaluate(TestExecutorRunnable.java:234)
     [exec] at org.junit.internal.runners.statements.RunBefores.evaluate(RunBefores.java:26)
     [exec] at org.junit.internal.runners.statements.RunAfters.evaluate(RunAfters.java:27)
     [exec] at com.liferay.portal.kernel.test.rule.AbstractTestRule$2.evaluate(AbstractTestRule.java:99)
     [exec] at com.liferay.portal.kernel.test.rule.AbstractTestRule$2.evaluate(AbstractTestRule.java:99)
     [exec] at com.liferay.portal.kernel.test.rule.AbstractTestRule$2.evaluate(AbstractTestRule.java:99)
     [exec] at com.liferay.portal.kernel.test.rule.AbstractTestRule$2.evaluate(AbstractTestRule.java:99)
     [exec] at com.liferay.portal.kernel.test.rule.AbstractTestRule$2.evaluate(AbstractTestRule.java:99)
     [exec] at com.liferay.portal.kernel.test.rule.TimeoutTestRule$1.evaluate(TimeoutTestRule.java:89)
     [exec] at org.junit.rules.RunRules.evaluate(RunRules.java:20)
     [exec] at com.liferay.arquillian.extension.junit.bridge.server.TestExecutorRunnable$1.evaluate(TestExecutorRunnable.java:143)
     [exec] at org.junit.internal.runners.statements.RunBefores.evaluate(RunBefores.java:26)
     [exec] at org.junit.internal.runners.statements.RunAfters.evaluate(RunAfters.java:27)
     [exec] at com.liferay.portal.kernel.test.rule.AbstractTestRule$1.evaluate(AbstractTestRule.java:59)
     [exec] at com.liferay.portal.kernel.test.rule.AbstractTestRule$1.evaluate(AbstractTestRule.java:59)
     [exec] at com.liferay.portal.kernel.test.rule.AbstractTestRule$1.evaluate(AbstractTestRule.java:59)
     [exec] at com.liferay.portal.kernel.test.rule.AbstractTestRule$1.evaluate(AbstractTestRule.java:59)
     [exec] at com.liferay.portal.kernel.test.rule.AbstractTestRule$1.evaluate(AbstractTestRule.java:59)
     [exec] at com.liferay.portal.kernel.test.rule.AbstractTestRule$1.evaluate(AbstractTestRule.java:59)
     [exec] at com.liferay.portal.kernel.test.rule.AbstractTestRule$1.evaluate(AbstractTestRule.java:59)
     [exec] at com.liferay.portal.kernel.test.rule.AbstractTestRule$1.evaluate(AbstractTestRule.java:59)
     [exec] at org.junit.rules.RunRules.evaluate(RunRules.java:20)
     [exec] at com.liferay.arquillian.extension.junit.bridge.server.TestExecutorRunnable._execute(TestExecutorRunnable.java:181)
     [exec] at com.liferay.arquillian.extension.junit.bridge.server.TestExecutorRunnable.run(TestExecutorRunnable.java:95)
     [exec] at java.lang.Thread.run(Thread.java:745)

    Full console log:

     https://test-1-17.liferay.com/job/test-portal-acceptance-pullrequest-batch(master)/AXIS_VARIABLE=0,label_exp=!master/342250/consoleFull

      Attachments

        Activity

          People

          Assignee:
          della.wang Della Wang (Inactive)
          Reporter:
          della.wang Della Wang (Inactive)
          Participants of an Issue:
          Recent user:
          Brian Wulbern
          Votes:
          0 Vote for this issue
          Watchers:
          0 Start watching this issue

            Dates

            Created:
            Updated:
            Resolved:
            Days since last comment:
            1 year, 17 weeks, 1 day ago

              Packages

              Version Package
              Master