Uploaded image for project: 'PUBLIC - Liferay Portal Community Edition'
  1. PUBLIC - Liferay Portal Community Edition
  2. LPS-106929

Semantic versioning is incorrect while checking com.liferay.frontend.taglib-5.0.0.jar

    Details

      Description

      Occurred on master CI tester´╝Ü

      [exec] > Task :apps:frontend-taglib:frontend-taglib:baseline FAILED
       [exec] PACKAGE_NAME DELTA CUR_VER BASE_VER REC_VER WARNINGS 
       [exec] = ================================================== ========== ========== ========== ========== ==========
       [exec] com.liferay.frontend.taglib.servlet.taglib.soy REMOVED 3.0.0 2.0.0 - PACKAGE REMOVED, UNNECESSARY PACKAGEINFO
       [exec] [Baseline Report] Mode: diff (persisted)
       [exec] 
       [exec] > Task :apps:frontend-taglib:frontend-taglib:syncVersions
       [exec] > Task :apps:frontend-taglib:frontend-taglib-react:baseline
       [exec] > Task :apps:frontend-taglib:frontend-taglib-react:syncVersions
       [exec] > Task :apps:frontend-taglib:frontend-taglib-clay:baseline
       [exec] > Task :apps:frontend-taglib:frontend-taglib-clay:syncVersions
       [exec] Gradle build finished at 2020-01-13 00:03:57.009.
       [exec] 356 actionable tasks: 320 executed, 36 up-to-date
       [exec] 
       [exec] 
       [exec] FAILURE: Build failed with an exception.
       [exec] 
       [exec] * What went wrong:
       [exec] Execution failed for task ':apps:frontend-taglib:frontend-taglib:baseline'.
       [exec] > Semantic versioning is incorrect while checking /opt/dev/projects/github/liferay-portal/tools/sdk/dist/com.liferay.frontend.taglib-5.0.0.jar against /opt/dev/projects/github/liferay-portal/.gradle/caches/modules-2/files-2.1/com.liferay/com.liferay.frontend.taglib/4.0.34/a8a754c1da53ea85bccab731e87ae165fae83c40/com.liferay.frontend.taglib-4.0.34.jar
       [exec] 
       [exec] * Try:
       [exec] Run with --info or --debug option to get more log output. Run with --scan to get full insights.
       [exec] 
       [exec] * Exception is:
       [exec] org.gradle.api.tasks.TaskExecutionException: Execution failed for task ':apps:frontend-taglib:frontend-taglib:baseline'.
       [exec] at org.gradle.api.internal.tasks.execution.ExecuteActionsTaskExecuter$3.accept(ExecuteActionsTaskExecuter.java:166)
       [exec] at org.gradle.api.internal.tasks.execution.ExecuteActionsTaskExecuter$3.accept(ExecuteActionsTaskExecuter.java:163)
       [exec] at org.gradle.internal.Try$Failure.ifSuccessfulOrElse(Try.java:191)
       [exec] at org.gradle.api.internal.tasks.execution.ExecuteActionsTaskExecuter.execute(ExecuteActionsTaskExecuter.java:156)
       [exec] at org.gradle.api.internal.tasks.execution.ValidatingTaskExecuter.execute(ValidatingTaskExecuter.java:62)
       [exec] at org.gradle.api.internal.tasks.execution.SkipEmptySourceFilesTaskExecuter.execute(SkipEmptySourceFilesTaskExecuter.java:108)
       [exec] at org.gradle.api.internal.tasks.execution.ResolveBeforeExecutionOutputsTaskExecuter.execute(ResolveBeforeExecutionOutputsTaskExecuter.java:67)
       [exec] at org.gradle.api.internal.tasks.execution.ResolveAfterPreviousExecutionStateTaskExecuter.execute(ResolveAfterPreviousExecutionStateTaskExecuter.java:46)
       [exec] at org.gradle.api.internal.tasks.execution.CleanupStaleOutputsExecuter.execute(CleanupStaleOutputsExecuter.java:94)
       [exec] at org.gradle.api.internal.tasks.execution.FinalizePropertiesTaskExecuter.execute(FinalizePropertiesTaskExecuter.java:46)
       [exec] at org.gradle.api.internal.tasks.execution.ResolveTaskExecutionModeExecuter.execute(ResolveTaskExecutionModeExecuter.java:95)
       [exec] at org.gradle.api.internal.tasks.execution.SkipTaskWithNoActionsExecuter.execute(SkipTaskWithNoActionsExecuter.java:57)
       [exec] at org.gradle.api.internal.tasks.execution.SkipOnlyIfTaskExecuter.execute(SkipOnlyIfTaskExecuter.java:56)
       [exec] at org.gradle.api.internal.tasks.execution.CatchExceptionTaskExecuter.execute(CatchExceptionTaskExecuter.java:36)
       [exec] at org.gradle.api.internal.tasks.execution.EventFiringTaskExecuter$1.executeTask(EventFiringTaskExecuter.java:77)
       [exec] at org.gradle.api.internal.tasks.execution.EventFiringTaskExecuter$1.call(EventFiringTaskExecuter.java:55)
       [exec] at org.gradle.api.internal.tasks.execution.EventFiringTaskExecuter$1.call(EventFiringTaskExecuter.java:52)
       [exec] at org.gradle.internal.operations.DefaultBuildOperationExecutor$CallableBuildOperationWorker.execute(DefaultBuildOperationExecutor.java:416)
       [exec] at org.gradle.internal.operations.DefaultBuildOperationExecutor$CallableBuildOperationWorker.execute(DefaultBuildOperationExecutor.java:406)
       [exec] at org.gradle.internal.operations.DefaultBuildOperationExecutor$1.execute(DefaultBuildOperationExecutor.java:165)
       [exec] at org.gradle.internal.operations.DefaultBuildOperationExecutor.execute(DefaultBuildOperationExecutor.java:250)
       [exec] at org.gradle.internal.operations.DefaultBuildOperationExecutor.execute(DefaultBuildOperationExecutor.java:158)
       [exec] at org.gradle.internal.operations.DefaultBuildOperationExecutor.call(DefaultBuildOperationExecutor.java:102)
       [exec] at org.gradle.internal.operations.DelegatingBuildOperationExecutor.call(DelegatingBuildOperationExecutor.java:36)
       [exec] at org.gradle.api.internal.tasks.execution.EventFiringTaskExecuter.execute(EventFiringTaskExecuter.java:52)
       [exec] at org.gradle.execution.plan.LocalTaskNodeExecutor.execute(LocalTaskNodeExecutor.java:43)
       [exec] at org.gradle.execution.taskgraph.DefaultTaskExecutionGraph$InvokeNodeExecutorsAction.execute(DefaultTaskExecutionGraph.java:355)
       [exec] at org.gradle.execution.taskgraph.DefaultTaskExecutionGraph$InvokeNodeExecutorsAction.execute(DefaultTaskExecutionGraph.java:343)
       [exec] at org.gradle.execution.taskgraph.DefaultTaskExecutionGraph$BuildOperationAwareExecutionAction.execute(DefaultTaskExecutionGraph.java:336)
       [exec] at org.gradle.execution.taskgraph.DefaultTaskExecutionGraph$BuildOperationAwareExecutionAction.execute(DefaultTaskExecutionGraph.java:322)
       [exec] at org.gradle.execution.plan.DefaultPlanExecutor$ExecutorWorker$1.execute(DefaultPlanExecutor.java:134)
       [exec] at org.gradle.execution.plan.DefaultPlanExecutor$ExecutorWorker$1.execute(DefaultPlanExecutor.java:129)
       [exec] at org.gradle.execution.plan.DefaultPlanExecutor$ExecutorWorker.execute(DefaultPlanExecutor.java:202)
       [exec] at org.gradle.execution.plan.DefaultPlanExecutor$ExecutorWorker.executeNextNode(DefaultPlanExecutor.java:193)
       [exec] at org.gradle.execution.plan.DefaultPlanExecutor$ExecutorWorker.run(DefaultPlanExecutor.java:129)
       [exec] at org.gradle.execution.plan.DefaultPlanExecutor.process(DefaultPlanExecutor.java:74)
       [exec] at org.gradle.execution.taskgraph.DefaultTaskExecutionGraph.executeWithServices(DefaultTaskExecutionGraph.java:178)
       [exec] at org.gradle.execution.taskgraph.DefaultTaskExecutionGraph.execute(DefaultTaskExecutionGraph.java:154)
       [exec] at org.gradle.execution.SelectedTaskExecutionAction.execute(SelectedTaskExecutionAction.java:41)
       [exec] at org.gradle.execution.DefaultBuildWorkExecutor.execute(DefaultBuildWorkExecutor.java:40)
       [exec] at org.gradle.execution.DefaultBuildWorkExecutor.access$000(DefaultBuildWorkExecutor.java:24)
       [exec] at org.gradle.execution.DefaultBuildWorkExecutor$1.proceed(DefaultBuildWorkExecutor.java:48)
       [exec] at org.gradle.execution.DryRunBuildExecutionAction.execute(DryRunBuildExecutionAction.java:49)
       [exec] at org.gradle.execution.DefaultBuildWorkExecutor.execute(DefaultBuildWorkExecutor.java:40)
       [exec] at org.gradle.execution.DefaultBuildWorkExecutor.execute(DefaultBuildWorkExecutor.java:33)
       [exec] at org.gradle.execution.IncludedBuildLifecycleBuildWorkExecutor.execute(IncludedBuildLifecycleBuildWorkExecutor.java:36)
       [exec] at org.gradle.execution.BuildOperationFiringBuildWorkerExecutor$ExecuteTasks.run(BuildOperationFiringBuildWorkerExecutor.java:56)
       [exec] at org.gradle.internal.operations.DefaultBuildOperationExecutor$RunnableBuildOperationWorker.execute(DefaultBuildOperationExecutor.java:402)
       [exec] at org.gradle.internal.operations.DefaultBuildOperationExecutor$RunnableBuildOperationWorker.execute(DefaultBuildOperationExecutor.java:394)
       [exec] at org.gradle.internal.operations.DefaultBuildOperationExecutor$1.execute(DefaultBuildOperationExecutor.java:165)
       [exec] at org.gradle.internal.operations.DefaultBuildOperationExecutor.execute(DefaultBuildOperationExecutor.java:250)
       [exec] at org.gradle.internal.operations.DefaultBuildOperationExecutor.execute(DefaultBuildOperationExecutor.java:158)
       [exec] at org.gradle.internal.operations.DefaultBuildOperationExecutor.run(DefaultBuildOperationExecutor.java:92)
       [exec] at org.gradle.internal.operations.DelegatingBuildOperationExecutor.run(DelegatingBuildOperationExecutor.java:31)
       [exec] at org.gradle.execution.BuildOperationFiringBuildWorkerExecutor.execute(BuildOperationFiringBuildWorkerExecutor.java:41)
       [exec] at org.gradle.initialization.DefaultGradleLauncher.runWork(DefaultGradleLauncher.java:236)
       [exec] at org.gradle.initialization.DefaultGradleLauncher.doClassicBuildStages(DefaultGradleLauncher.java:147)
       [exec] at org.gradle.initialization.DefaultGradleLauncher.doBuildStages(DefaultGradleLauncher.java:126)
       [exec] at org.gradle.initialization.DefaultGradleLauncher.executeTasks(DefaultGradleLauncher.java:106)
       [exec] at org.gradle.internal.invocation.GradleBuildController$1.execute(GradleBuildController.java:60)
       [exec] at org.gradle.internal.invocation.GradleBuildController$1.execute(GradleBuildController.java:57)
       [exec] at org.gradle.internal.invocation.GradleBuildController$3.create(GradleBuildController.java:85)
       [exec] at org.gradle.internal.invocation.GradleBuildController$3.create(GradleBuildController.java:78)
       [exec] at org.gradle.internal.work.DefaultWorkerLeaseService.withLocks(DefaultWorkerLeaseService.java:189)
       [exec] at org.gradle.internal.work.StopShieldingWorkerLeaseService.withLocks(StopShieldingWorkerLeaseService.java:40)
       [exec] at org.gradle.internal.invocation.GradleBuildController.doBuild(GradleBuildController.java:78)
       [exec] at org.gradle.internal.invocation.GradleBuildController.run(GradleBuildController.java:57)
       [exec] at org.gradle.tooling.internal.provider.ExecuteBuildActionRunner.run(ExecuteBuildActionRunner.java:31)
       [exec] at org.gradle.launcher.exec.ChainingBuildActionRunner.run(ChainingBuildActionRunner.java:35)
       [exec] at org.gradle.launcher.exec.BuildOutcomeReportingBuildActionRunner.run(BuildOutcomeReportingBuildActionRunner.java:63)
       [exec] at org.gradle.tooling.internal.provider.ValidatingBuildActionRunner.run(ValidatingBuildActionRunner.java:32)
       [exec] at org.gradle.launcher.exec.BuildCompletionNotifyingBuildActionRunner.run(BuildCompletionNotifyingBuildActionRunner.java:39)
       [exec] at org.gradle.launcher.exec.RunAsBuildOperationBuildActionRunner$3.call(RunAsBuildOperationBuildActionRunner.java:51)
       [exec] at org.gradle.launcher.exec.RunAsBuildOperationBuildActionRunner$3.call(RunAsBuildOperationBuildActionRunner.java:45)
       [exec] at org.gradle.internal.operations.DefaultBuildOperationExecutor$CallableBuildOperationWorker.execute(DefaultBuildOperationExecutor.java:416)
       [exec] at org.gradle.internal.operations.DefaultBuildOperationExecutor$CallableBuildOperationWorker.execute(DefaultBuildOperationExecutor.java:406)
       [exec] at org.gradle.internal.operations.DefaultBuildOperationExecutor$1.execute(DefaultBuildOperationExecutor.java:165)
       [exec] at org.gradle.internal.operations.DefaultBuildOperationExecutor.execute(DefaultBuildOperationExecutor.java:250)
       [exec] at org.gradle.internal.operations.DefaultBuildOperationExecutor.execute(DefaultBuildOperationExecutor.java:158)
       [exec] at org.gradle.internal.operations.DefaultBuildOperationExecutor.call(DefaultBuildOperationExecutor.java:102)
       [exec] at org.gradle.internal.operations.DelegatingBuildOperationExecutor.call(DelegatingBuildOperationExecutor.java:36)
       [exec] at org.gradle.launcher.exec.RunAsBuildOperationBuildActionRunner.run(RunAsBuildOperationBuildActionRunner.java:45)
       [exec] at org.gradle.launcher.exec.InProcessBuildActionExecuter$1.transform(InProcessBuildActionExecuter.java:50)
       [exec] at org.gradle.launcher.exec.InProcessBuildActionExecuter$1.transform(InProcessBuildActionExecuter.java:47)
       [exec] at org.gradle.composite.internal.DefaultRootBuildState.run(DefaultRootBuildState.java:78)
       [exec] at org.gradle.launcher.exec.InProcessBuildActionExecuter.execute(InProcessBuildActionExecuter.java:47)
       [exec] at org.gradle.launcher.exec.InProcessBuildActionExecuter.execute(InProcessBuildActionExecuter.java:31)
       [exec] at org.gradle.launcher.exec.BuildTreeScopeBuildActionExecuter.execute(BuildTreeScopeBuildActionExecuter.java:42)
       [exec] at org.gradle.launcher.exec.BuildTreeScopeBuildActionExecuter.execute(BuildTreeScopeBuildActionExecuter.java:28)
       [exec] at org.gradle.tooling.internal.provider.ContinuousBuildActionExecuter.execute(ContinuousBuildActionExecuter.java:78)
       [exec] at org.gradle.tooling.internal.provider.ContinuousBuildActionExecuter.execute(ContinuousBuildActionExecuter.java:52)
       [exec] at org.gradle.tooling.internal.provider.SubscribableBuildActionExecuter.execute(SubscribableBuildActionExecuter.java:59)
       [exec] at org.gradle.tooling.internal.provider.SubscribableBuildActionExecuter.execute(SubscribableBuildActionExecuter.java:36)
       [exec] at org.gradle.tooling.internal.provider.SessionScopeBuildActionExecuter.execute(SessionScopeBuildActionExecuter.java:68)
       [exec] at org.gradle.tooling.internal.provider.SessionScopeBuildActionExecuter.execute(SessionScopeBuildActionExecuter.java:38)
       [exec] at org.gradle.tooling.internal.provider.GradleThreadBuildActionExecuter.execute(GradleThreadBuildActionExecuter.java:37)
       [exec] at org.gradle.tooling.internal.provider.GradleThreadBuildActionExecuter.execute(GradleThreadBuildActionExecuter.java:26)
       [exec] at org.gradle.tooling.internal.provider.ParallelismConfigurationBuildActionExecuter.execute(ParallelismConfigurationBuildActionExecuter.java:43)
       [exec] at org.gradle.tooling.internal.provider.ParallelismConfigurationBuildActionExecuter.execute(ParallelismConfigurationBuildActionExecuter.java:29)
       [exec] at org.gradle.tooling.internal.provider.StartParamsValidatingActionExecuter.execute(StartParamsValidatingActionExecuter.java:60)
       [exec] at org.gradle.tooling.internal.provider.StartParamsValidatingActionExecuter.execute(StartParamsValidatingActionExecuter.java:32)
       [exec] at org.gradle.tooling.internal.provider.SessionFailureReportingActionExecuter.execute(SessionFailureReportingActionExecuter.java:55)
       [exec] at org.gradle.tooling.internal.provider.SessionFailureReportingActionExecuter.execute(SessionFailureReportingActionExecuter.java:41)
       [exec] at org.gradle.tooling.internal.provider.SetupLoggingActionExecuter.execute(SetupLoggingActionExecuter.java:48)
       [exec] at org.gradle.tooling.internal.provider.SetupLoggingActionExecuter.execute(SetupLoggingActionExecuter.java:32)
       [exec] at org.gradle.launcher.cli.RunBuildAction.run(RunBuildAction.java:56)
       [exec] at org.gradle.internal.Actions$RunnableActionAdapter.execute(Actions.java:212)
       [exec] at org.gradle.launcher.cli.DefaultCommandLineActionFactory$ParseAndBuildAction.execute(DefaultCommandLineActionFactory.java:404)
       [exec] at org.gradle.launcher.cli.DefaultCommandLineActionFactory$ParseAndBuildAction.execute(DefaultCommandLineActionFactory.java:376)
       [exec] at org.gradle.launcher.cli.ExceptionReportingAction.execute(ExceptionReportingAction.java:38)
       [exec] at org.gradle.launcher.cli.ExceptionReportingAction.execute(ExceptionReportingAction.java:23)
       [exec] at org.gradle.launcher.cli.DefaultCommandLineActionFactory$WithLogging.execute(DefaultCommandLineActionFactory.java:369)
       [exec] at org.gradle.launcher.Main.doAction(Main.java:35)
       [exec] at org.gradle.launcher.bootstrap.EntryPoint.run(EntryPoint.java:45)
       [exec] at org.gradle.launcher.bootstrap.ProcessBootstrap.runNoExit(ProcessBootstrap.java:60)
       [exec] at org.gradle.launcher.bootstrap.ProcessBootstrap.run(ProcessBootstrap.java:37)
       [exec] at org.gradle.launcher.GradleMain.main(GradleMain.java:31)
       [exec] at org.gradle.wrapper.BootstrapMainStarter.start(BootstrapMainStarter.java:31)
       [exec] at org.gradle.wrapper.WrapperExecutor.execute(WrapperExecutor.java:108)
       [exec] at org.gradle.wrapper.GradleWrapperMain.main(GradleWrapperMain.java:63)
       [exec] Caused by: org.gradle.api.GradleException: Semantic versioning is incorrect while checking /opt/dev/projects/github/liferay-portal/tools/sdk/dist/com.liferay.frontend.taglib-5.0.0.jar against /opt/dev/projects/github/liferay-portal/.gradle/caches/modules-2/files-2.1/com.liferay/com.liferay.frontend.taglib/4.0.34/a8a754c1da53ea85bccab731e87ae165fae83c40/com.liferay.frontend.taglib-4.0.34.jar

      Full console log:

      https://test-1-23.liferay.com/job/test-portal-acceptance-pullrequest-batch(master)/AXIS_VARIABLE=6,label_exp=!master/218937/consoleFull

        Attachments

          Activity

            People

            Assignee:
            john.co John Co
            Reporter:
            della.wang Della Wang (Inactive)
            Participants of an Issue:
            Recent user:
            Jason Pince
            Votes:
            0 Vote for this issue
            Watchers:
            0 Start watching this issue

              Dates

              Created:
              Updated:
              Resolved:
              Days since last comment:
              1 year, 6 weeks, 6 days ago

                Packages

                Version Package
                7.3.0 CE GA1
                7.3.10 DXP GA1
                Master