Uploaded image for project: 'PUBLIC - Liferay Portal Community Edition'
  1. PUBLIC - Liferay Portal Community Edition
  2. LPS-107297

AssertionError in WorkflowMetricsSLADefinitionTransformerMessageListenerTest

    Details

    • Type: Bug
    • Status: Open
    • Resolution: Unresolved
    • Affects Version/s: Master
    • Fix Version/s: None
    • Component/s: Workflow
    • Labels:

      Description

       

      AssertionError in WorkflowMetricsSLADefinitionTransformerMessageListenerTest

      [exec] com.liferay.portal.workflow.metrics.service.internal.messaging.test.WorkflowMetricsSLADefinitionTransformerMessageListenerTest > testTransform1 STARTED 
      [exec] 
      [exec] com.liferay.portal.workflow.metrics.service.internal.messaging.test.WorkflowMetricsSLADefinitionTransformerMessageListenerTest > testTransform1 FAILED 
      [exec] java.lang.AssertionError: workflow-metrics-nodes WorkflowMetricsNodeType {"size":0,"query":{"bool":{"must":[{"term":{"companyId":{"value":20096}}},{"term":{"deleted":{"value":false}}},{"term":{"processId":{"value":66829}}},{"term":{"version":{"value":"1.0"}}}]}}} expected:<4> but was:<0> 
      [exec] at org.junit.Assert.fail(Assert.java:88) 
      [exec] at org.junit.Assert.failNotEquals(Assert.java:834) 
      [exec] at org.junit.Assert.assertEquals(Assert.java:645) 
      [exec] at com.liferay.portal.workflow.metrics.service.util.BaseWorkflowMetricsTestCase.lambda$retryAssertCount$5(BaseWorkflowMetricsTestCase.java:174) 
      [exec] at com.liferay.portal.search.test.util.IdempotentRetryAssert.retryAssert(IdempotentRetryAssert.java:43) 
      [exec] at com.liferay.portal.search.test.util.IdempotentRetryAssert.retryAssert(IdempotentRetryAssert.java:29) 
      [exec] at com.liferay.portal.workflow.metrics.service.util.BaseWorkflowMetricsTestCase.retryAssertCount(BaseWorkflowMetricsTestCase.java:150) 
      [exec] at com.liferay.portal.workflow.metrics.service.internal.messaging.test.WorkflowMetricsSLADefinitionTransformerMessageListenerTest.testTransform1(WorkflowMetricsSLADefinitionTransformerMessageListenerTest.java:73) 
      [exec] at sun.reflect.NativeMethodAccessorImpl.invoke0(Native Method) 
      [exec] at sun.reflect.NativeMethodAccessorImpl.invoke(NativeMethodAccessorImpl.java:62) 
      [exec] at sun.reflect.DelegatingMethodAccessorImpl.invoke(DelegatingMethodAccessorImpl.java:43) 
      [exec] at java.lang.reflect.Method.invoke(Method.java:498) [exec] at com.liferay.arquillian.extension.junit.bridge.server.TestExecutorRunnable$2.evaluate(TestExecutorRunnable.java:234) 
      [exec] at org.junit.internal.runners.statements.RunBefores.evaluate(RunBefores.java:26) 
      [exec] at com.liferay.portal.kernel.test.rule.AbstractTestRule$2.evaluate(AbstractTestRule.java:99) 
      [exec] at com.liferay.portal.kernel.test.rule.AbstractTestRule$2.evaluate(AbstractTestRule.java:99) 
      [exec] at com.liferay.portal.kernel.test.rule.AbstractTestRule$2.evaluate(AbstractTestRule.java:99) 
      [exec] at com.liferay.portal.kernel.test.rule.AbstractTestRule$2.evaluate(AbstractTestRule.java:99) 
      [exec] at com.liferay.portal.kernel.test.rule.AbstractTestRule$2.evaluate(AbstractTestRule.java:99) 
      [exec] at com.liferay.portal.kernel.test.rule.TimeoutTestRule$1.evaluate(TimeoutTestRule.java:89) 
      [exec] at org.junit.rules.RunRules.evaluate(RunRules.java:20) 
      [exec] at com.liferay.arquillian.extension.junit.bridge.server.TestExecutorRunnable$1.evaluate(TestExecutorRunnable.java:143) 
      [exec] at com.liferay.portal.kernel.test.rule.AbstractTestRule$1.evaluate(AbstractTestRule.java:59) 
      [exec] at com.liferay.portal.kernel.test.rule.AbstractTestRule$1.evaluate(AbstractTestRule.java:59)
      [exec] at com.liferay.portal.kernel.test.rule.AbstractTestRule$1.evaluate(AbstractTestRule.java:59) 
      [exec] at com.liferay.portal.kernel.test.rule.AbstractTestRule$1.evaluate(AbstractTestRule.java:59) 
      [exec] at com.liferay.portal.kernel.test.rule.AbstractTestRule$1.evaluate(AbstractTestRule.java:59) 
      [exec] at com.liferay.portal.kernel.test.rule.AbstractTestRule$1.evaluate(AbstractTestRule.java:59) 
      [exec] at com.liferay.portal.kernel.test.rule.AbstractTestRule$1.evaluate(AbstractTestRule.java:59) 
      [exec] at com.liferay.portal.kernel.test.rule.AbstractTestRule$1.evaluate(AbstractTestRule.java:59) 
      [exec] at org.junit.rules.RunRules.evaluate(RunRules.java:20) [exec] at com.liferay.arquillian.extension.junit.bridge.server.TestExecutorRunnable._execute(TestExecutorRunnable.java:181) 
      [exec] at com.liferay.arquillian.extension.junit.bridge.server.TestExecutorRunnable.run(TestExecutorRunnable.java:95) [exec] at java.lang.Thread.run(Thread.java:745)
      

       

       

        Attachments

          Activity

            People

            • Assignee:
              support-lep@liferay.com SE Support
              Reporter:
              nicholas.kwon Nicholas Kwon
              Participants of an Issue:
              Recent user:
              Brian Wulbern
            • Votes:
              0 Vote for this issue
              Watchers:
              0 Start watching this issue

              Dates

              • Created:
                Updated:
                Days since last comment:
                4 weeks, 2 days ago

                Packages

                Version Package