Uploaded image for project: 'PUBLIC - Liferay Portal Community Edition'
  1. PUBLIC - Liferay Portal Community Edition
  2. LPS-107531

PortalLogAssertorTest AssertionFailedError find on 7.2 FP4 run

    Details

    • Type: Regression Bug
    • Status: Closed
    • Resolution: No Longer Reproducible
    • Affects Version/s: 7.2.X
    • Fix Version/s: None
    • Component/s: Portal Configuration
    • Labels:
    • Fix Priority:
      4

      Description

      This issue is found on 7.2 FP4 build2
      For modules-integration-bundle-mariadb102-jdk8:

       [junit] Tests run: 2, Failures: 2, Errors: 0, Skipped: 0, Time elapsed: 0.362 sec
          [junit] Tests run: 2, Failures: 2, Errors: 0, Skipped: 0, Time elapsed: 0.362 sec
          [junit] 
          [junit] Testcase: testScanXMLLog(com.liferay.portal.log.assertor.PortalLogAssertorTest):	FAILED
          [junit] 
          [junit] Portal log assert failure, see above log for more information: 
          [junit] Update failed
          [junit] junit.framework.AssertionFailedError: 
          [junit] Update failed
          [junit] 	at com.liferay.portal.log.assertor.PortalLogAssertorTest.scanXMLLogFile(PortalLogAssertorTest.java:172)
          [junit] 	at com.liferay.portal.log.assertor.PortalLogAssertorTest$1.visitFile(PortalLogAssertorTest.java:98)
          [junit] 	at com.liferay.portal.log.assertor.PortalLogAssertorTest$1.visitFile(PortalLogAssertorTest.java:88)
          [junit] 	at java.nio.file.Files.walkFileTree(Files.java:2670)
          [junit] 	at java.nio.file.Files.walkFileTree(Files.java:2742)
          [junit] 	at com.liferay.portal.log.assertor.PortalLogAssertorTest.testScanXMLLog(PortalLogAssertorTest.java:86)
          [junit] 
          [junit] 
          [junit] Testcase: testScanOSGiLog(com.liferay.portal.log.assertor.PortalLogAssertorTest):	FAILED
          [junit] 
          [junit] Portal log assert failure, OSGi log found: /opt/dev/projects/github/liferay-portal-7.2.x-private/bundles/osgi/state/1579630110148.log:
          [junit] !SESSION 2020-01-21 18:31:28.457 -----------------------------------------------
          [junit] eclipse.buildId=unknown
          [junit] java.version=1.8.0_121
          [junit] java.vendor=Oracle Corporation
          [junit] BootLoader constants: OS=linux, ARCH=x86_64, WS=gtk, NL=en_US
          [junit] 
          [junit] !ENTRY org.apache.felix.configadmin 4 0 2020-01-21 18:31:28.457
          [junit] !MESSAGE Worker thread CM Configuration Updater did not terminate within 5 seconds; trying to kill
          [junit] 
          [junit] 
          [junit] junit.framework.AssertionFailedError: 
          [junit] Portal log assert failure, OSGi log found: /opt/dev/projects/github/liferay-portal-7.2.x-private/bundles/osgi/state/1579630110148.log:
          [junit] !SESSION 2020-01-21 18:31:28.457 -----------------------------------------------
          [junit] eclipse.buildId=unknown
          [junit] java.version=1.8.0_121
          [junit] java.vendor=Oracle Corporation
          [junit] BootLoader constants: OS=linux, ARCH=x86_64, WS=gtk, NL=en_US
          [junit] 
          [junit] !ENTRY org.apache.felix.configadmin 4 0 2020-01-21 18:31:28.457
          [junit] !MESSAGE Worker thread CM Configuration Updater did not terminate within 5 seconds; trying to kill
          [junit] 
          [junit] 
          [junit] 	at com.liferay.portal.log.assertor.PortalLogAssertorTest.testScanOSGiLog(PortalLogAssertorTest.java:81)
          [junit] 
          [junit] 
          [junit] Test com.liferay.portal.log.assertor.PortalLogAssertorTest FAILED
      [stopwatch] [test.cmd: 0.778 sec]
           [exec] ab823822bda2
           [exec] ab823822bda2
         [delete] Deleting: /opt/dev/projects/github/liferay-portal-7.2.x-private/docker_stop.sh
      [stopwatch] [run.batch.test.action: 24:39.369 sec]
      

        Attachments

          Activity

            People

            Assignee:
            patricia.perez Patricia Perez
            Reporter:
            sylvia.luan Sylvia Luan
            Participants of an Issue:
            Recent user:
            Walter Shao
            Votes:
            0 Vote for this issue
            Watchers:
            0 Start watching this issue

              Dates

              Created:
              Updated:
              Resolved:
              Days since last comment:
              29 weeks ago

                Packages

                Version Package