Details

      Description

           [exec] > Task :private:apps:osb-koroneiki:osb-koroneiki-phloem:osb-koroneiki-phloem-rest-test:compileTestIntegrationJava
           [exec] /opt/dev/projects/github/liferay-portal-7.2.x/modules/apps/microblogs/microblogs-api/src/main/java/com/liferay/microblogs/model/MicroblogsEntrySoap.java:29: warning - Tag @link: reference not found: com.liferay.microblogs.service.http.MicroblogsEntryServiceSoap
           [exec] /opt/dev/projects/github/liferay-portal-7.2.x/modules/private/apps/osb-koroneiki/osb-koroneiki-phloem/osb-koroneiki-phloem-rest-test/src/testIntegration/java/com/liferay/osb/koroneiki/phloem/rest/resource/v1_0/test/BasePostalAddressResourceTestCase.java:315: error: method getPostalAddressHttpResponse in interface PostalAddressResource cannot be applied to given types;
           [exec] 			postalAddressResource.getPostalAddressHttpResponse(
           [exec] 			                     ^
           [exec]   required: Long
           [exec]   found: <null>,Long
           [exec]   reason: actual and formal argument lists differ in length
           [exec] /opt/dev/projects/github/liferay-portal-7.2.x/modules/private/apps/osb-koroneiki/osb-koroneiki-phloem/osb-koroneiki-phloem-rest-test/src/testIntegration/java/com/liferay/osb/koroneiki/phloem/rest/resource/v1_0/test/BasePostalAddressResourceTestCase.java:319: error: method getPostalAddressHttpResponse in interface PostalAddressResource cannot be applied to given types;
           [exec] 			404, postalAddressResource.getPostalAddressHttpResponse(null, 0L));
           [exec] 			                          ^
           [exec]   required: Long
           [exec]   found: <null>,long
           [exec]   reason: actual and formal argument lists differ in length
           [exec] /opt/dev/projects/github/liferay-portal-7.2.x/modules/private/apps/osb-koroneiki/osb-koroneiki-phloem/osb-koroneiki-phloem-rest-test/src/testIntegration/java/com/liferay/osb/koroneiki/phloem/rest/resource/v1_0/test/BasePostalAddressResourceTestCase.java:430: error: method putPostalAddress in interface PostalAddressResource cannot be applied to given types;
           [exec] 		PostalAddress putPostalAddress = postalAddressResource.putPostalAddress(
           [exec] 		                                                      ^
           [exec]   required: String,Long,PostalAddress
           [exec]   found: Long,PostalAddress
           [exec]   reason: actual and formal argument lists differ in length
           [exec] 
           [exec] > Task :apps:microblogs:microblogs-api:javadoc
           [exec] 11 warnings
           [exec] 
           [exec] > Task :apps:microblogs:microblogs-api:jarJavadoc
           [exec] > Task :apps:microblogs:microblogs-api:jarSources
           [exec] 
           [exec] > Task :private:apps:osb-koroneiki:osb-koroneiki-phloem:osb-koroneiki-phloem-rest-test:compileTestIntegrationJava FAILED
      
           [exec] FAILURE: Build failed with an exception.
           [exec] 
           [exec] * What went wrong:
           [exec] Execution failed for task ':private:apps:osb-koroneiki:osb-koroneiki-phloem:osb-koroneiki-phloem-rest-test:compileTestIntegrationJava'.
           [exec] > Compilation failed; see the compiler error output for details.
           [exec] 
           [exec] * Try:
           [exec] Run with --info or --debug option to get more log output. Run with --scan to get full insights.
           [exec] 
           [exec] * Exception is:
           [exec] org.gradle.api.tasks.TaskExecutionException: Execution failed for task ':private:apps:osb-koroneiki:osb-koroneiki-phloem:osb-koroneiki-phloem-rest-test:compileTestIntegrationJava'.
      

        Attachments

          Activity

            People

            Assignee:
            javier.gamarra Javier Gamarra
            Reporter:
            kristin.onias Kristin Onias
            Participants of an Issue:
            Recent user:
            Enterprise Release HU
            Votes:
            0 Vote for this issue
            Watchers:
            0 Start watching this issue

              Dates

              Created:
              Updated:
              Resolved:
              Days since last comment:
              1 year, 3 weeks, 5 days ago

                Packages

                Version Package
                7.0.X
                7.1.X
                7.2.X
                Master