Uploaded image for project: 'PUBLIC - Liferay Portal Community Edition'
  1. PUBLIC - Liferay Portal Community Edition
  2. LPS-108223

Investigate packageRunTest failure in js-unit-jdk8/0

    Details

      Description

      js-unit-jdk8/0 is failing here:

           [exec] > Task :dxp:apps:portal-workflow:portal-workflow-kaleo-designer-web:packageRunTest FAILED
           [exec] [32m06 02 2020 03:14:03.329:INFO [karma-server]: [39mKarma v4.0.0 server started at http://0.0.0.0:9877/
           [exec] [32m06 02 2020 03:14:03.339:INFO [launcher]: [39mLaunching browsers Firefox with concurrency unlimited
           [exec] [32m06 02 2020 03:14:03.347:INFO [launcher]: [39mStarting browser Firefox
           [exec] [32m06 02 2020 03:14:20.127:INFO [Firefox 68.0.0 (Linux 0.0.0)]: [39mConnected on socket CFeGkzJAoykTMFgNAAAA with id 11406764
           [exec] Firefox 68.0.0 (Linux 0.0.0): Executed 0 of 12[32m SUCCESS[39m (0 secs / 0 secs)
           [exec] [1A[2K[31mFirefox 68.0.0 (Linux 0.0.0) Liferay.KaleoDesignerXMLDefinitionSerializer "before all" hook FAILED[39m
           [exec] 	timeout of 2000ms exceeded. Ensure the done() callback is being called in this test.
           [exec] Firefox 68.0.0 (Linux 0.0.0): Executed 1 of 12[31m (1 FAILED)[39m (0 secs / 2.002 secs)
           [exec] [1A[2KFirefox 68.0.0 (Linux 0.0.0): Executed 2 of 12[31m (1 FAILED)[39m (0 secs / 2.54 secs)
           [exec] [1A[2KFirefox 68.0.0 (Linux 0.0.0): Executed 3 of 12[31m (1 FAILED)[39m (0 secs / 2.662 secs)
           [exec] [1A[2KFirefox 68.0.0 (Linux 0.0.0): Executed 4 of 12[31m (1 FAILED)[39m (0 secs / 2.804 secs)
           [exec] [1A[2KFirefox 68.0.0 (Linux 0.0.0): Executed 5 of 12[31m (1 FAILED)[39m (0 secs / 2.825 secs)
           [exec] [1A[2KFirefox 68.0.0 (Linux 0.0.0): Executed 6 of 12[31m (1 FAILED)[39m (0 secs / 3.623 secs)
           [exec] [1A[2KFirefox 68.0.0 (Linux 0.0.0): Executed 6 of 12[31m (1 FAILED)[39m (4.463 secs / 3.623 secs)
           [exec] [31mTOTAL: 1 FAILED, 5 SUCCESS[39m
           [exec] error Command failed with exit code 1.
           [exec] info Visit https://yarnpkg.com/en/docs/cli/run for documentation about this command.
      

        Attachments

          Activity

            People

            Assignee:
            kristin.onias Kristin Onias
            Reporter:
            kristin.onias Kristin Onias
            Participants of an Issue:
            Recent user:
            Csaba Turcsan
            Votes:
            0 Vote for this issue
            Watchers:
            0 Start watching this issue

              Dates

              Created:
              Updated:
              Resolved:
              Days since last comment:
              2 years, 14 weeks, 1 day ago

                Packages

                Version Package
                7.2.X