Uploaded image for project: 'PUBLIC - Liferay Portal Community Edition'
  1. PUBLIC - Liferay Portal Community Edition
  2. LPS-108238

LocalFile.StagingBlogs cannot proceed with staging

    Details

    • Type: Bug
    • Status: Closed
    • Resolution: Duplicate
    • Affects Version/s: Master
    • Fix Version/s: None
    • Component/s: Blogs, Staging

      Description

      Full Jenkins Log

      Poshi Summary

      Testray

      [exec]     BUILD FAILED: Element is not present at "//li[contains(@class,'control-menu-link')]//a[contains(.,'Staging')]"
           [exec]     /opt/dev/projects/github/liferay-portal/portal-web/test/functional/com/liferay/portalweb/macros/Navigator.macro[gotoStagedView]:182
           [exec]     /opt/dev/projects/github/liferay-portal/portal-web/test/functional/com/liferay/portalweb/tests/enduser/collaboration/blogs/StagingBlogs.testcase[StagingBlogsCP]:478
           [exec] 
           [exec] 
           [exec] com.liferay.poshi.runner.PoshiRunner > test[LocalFile.StagingBlogs#StagingBlogsCP] STANDARD_ERROR
           [exec]     java.lang.RuntimeException: Element is not present at "//li[contains(@class,'control-menu-link')]//a[contains(.,'Staging')]"
           [exec]     	at com.liferay.poshi.runner.selenium.BaseWebDriverImpl.getWebElement(BaseWebDriverImpl.java:4216)
           [exec]     	at com.liferay.poshi.runner.selenium.ChromeWebDriverImpl.getWebElement(ChromeWebDriverImpl.java:127)
           [exec]     	at com.liferay.poshi.runner.selenium.BaseWebDriverImpl.getWebElement(BaseWebDriverImpl.java:4206)
           [exec]     	at com.liferay.poshi.runner.selenium.BaseWebDriverImpl$26.evaluate(BaseWebDriverImpl.java:4179)
           [exec]     	at com.liferay.poshi.runner.selenium.BaseWebDriverImpl.isVisibleInPage(BaseWebDriverImpl.java:1763)
           [exec]     	at com.liferay.poshi.runner.selenium.BaseWebDriverImpl$25.evaluate(BaseWebDriverImpl.java:4165)
           [exec]     	at com.liferay.poshi.runner.selenium.BaseWebDriverImpl$Condition.assertTrue(BaseWebDriverImpl.java:4418)
           [exec]     	at com.liferay.poshi.runner.selenium.BaseWebDriverImpl$Condition.waitFor(BaseWebDriverImpl.java:4454)
           [exec]     	at com.liferay.poshi.runner.selenium.BaseWebDriverImpl.waitForVisible(BaseWebDriverImpl.java:3381)
           [exec]     	at sun.reflect.GeneratedMethodAccessor9.invoke(Unknown Source)
           [exec]     	at sun.reflect.DelegatingMethodAccessorImpl.invoke(DelegatingMethodAccessorImpl.java:43)
           [exec]     	at java.lang.reflect.Method.invoke(Method.java:498)
           [exec]     	at com.liferay.poshi.runner.PoshiRunnerExecutor$1.call(PoshiRunnerExecutor.java:1195)
           [exec]     	at java.util.concurrent.FutureTask.run(FutureTask.java:266)
           [exec]     	at java.util.concurrent.ThreadPoolExecutor.runWorker(ThreadPoolExecutor.java:1142)
           [exec]     	at java.util.concurrent.ThreadPoolExecutor$Worker.run(ThreadPoolExecutor.java:617)
           [exec]     	at java.lang.Thread.run(Thread.java:745)
           [exec] 
           [exec] com.liferay.poshi.runner.PoshiRunner > test[LocalFile.StagingBlogs#StagingBlogsCP] FAILED
           [exec]     java.lang.RuntimeException
      

        Attachments

          Issue Links

            Activity

              People

              • Assignee:
                joyce.wang Joyce Wang
                Reporter:
                calvin.vo Calvin Vo
                Participants of an Issue:
                Recent user:
                Brian Wulbern
              • Votes:
                0 Vote for this issue
                Watchers:
                0 Start watching this issue

                Dates

                • Created:
                  Updated:
                  Resolved:
                  Days since last comment:
                  26 weeks, 2 days ago

                  Packages

                  Version Package