Uploaded image for project: 'PUBLIC - Liferay Portal Community Edition'
  1. PUBLIC - Liferay Portal Community Edition
  2. LPS-108380

AccountResourceTest failed with Instantiation Exception

    Details

      Description

      Full Jenkins Log

      Testray

      [exec] com.liferay.account.rest.resource.v1_0.test.AccountResourceTest > testPatchAccount FAILED
           [exec]     java.lang.InstantiationException: com.liferay.account.rest.resource.v1_0.test.AccountResourceTest$1
           [exec]     	at java.lang.Class.newInstance(Class.java:427)
           [exec]     	at org.apache.commons.beanutils.BeanUtilsBean.cloneBean(BeanUtilsBean.java:180)
           [exec]     	at org.apache.commons.beanutils.BeanUtils.cloneBean(BeanUtils.java:108)
           [exec]     	at com.liferay.account.rest.resource.v1_0.test.BaseAccountResourceTestCase.testPatchAccount(BaseAccountResourceTestCase.java:592)
           [exec]     	at sun.reflect.NativeMethodAccessorImpl.invoke0(Native Method)
           [exec]     	at sun.reflect.NativeMethodAccessorImpl.invoke(NativeMethodAccessorImpl.java:62)
           [exec]     	at sun.reflect.DelegatingMethodAccessorImpl.invoke(DelegatingMethodAccessorImpl.java:43)
           [exec]     	at java.lang.reflect.Method.invoke(Method.java:498)
           [exec]     	at com.liferay.arquillian.extension.junit.bridge.server.TestExecutorRunnable$2.evaluate(TestExecutorRunnable.java:234)
           [exec]     	at org.junit.internal.runners.statements.RunBefores.evaluate(RunBefores.java:26)
           [exec]     	at org.junit.internal.runners.statements.RunAfters.evaluate(RunAfters.java:27)
           [exec]     	at com.liferay.portal.kernel.test.rule.AbstractTestRule$2.evaluate(AbstractTestRule.java:99)
           [exec]     	at com.liferay.portal.kernel.test.rule.AbstractTestRule$2.evaluate(AbstractTestRule.java:99)
           [exec]     	at com.liferay.portal.kernel.test.rule.AbstractTestRule$2.evaluate(AbstractTestRule.java:99)
           [exec]     	at com.liferay.portal.kernel.test.rule.AbstractTestRule$2.evaluate(AbstractTestRule.java:99)
           [exec]     	at com.liferay.portal.kernel.test.rule.AbstractTestRule$2.evaluate(AbstractTestRule.java:99)
           [exec]     	at com.liferay.portal.kernel.test.rule.TimeoutTestRule$1.evaluate(TimeoutTestRule.java:89)
           [exec]     	at org.junit.rules.RunRules.evaluate(RunRules.java:20)
           [exec]     	at com.liferay.arquillian.extension.junit.bridge.server.TestExecutorRunnable$1.evaluate(TestExecutorRunnable.java:143)
           [exec]     	at org.junit.internal.runners.statements.RunBefores.evaluate(RunBefores.java:26)
           [exec]     	at com.liferay.portal.kernel.test.rule.AbstractTestRule$1.evaluate(AbstractTestRule.java:59)
           [exec]     	at com.liferay.portal.kernel.test.rule.AbstractTestRule$1.evaluate(AbstractTestRule.java:59)
           [exec]     	at com.liferay.portal.kernel.test.rule.AbstractTestRule$1.evaluate(AbstractTestRule.java:59)
           [exec]     	at com.liferay.portal.kernel.test.rule.AbstractTestRule$1.evaluate(AbstractTestRule.java:59)
           [exec]     	at com.liferay.portal.kernel.test.rule.AbstractTestRule$1.evaluate(AbstractTestRule.java:59)
           [exec]     	at com.liferay.portal.kernel.test.rule.AbstractTestRule$1.evaluate(AbstractTestRule.java:59)
           [exec]     	at com.liferay.portal.kernel.test.rule.AbstractTestRule$1.evaluate(AbstractTestRule.java:59)
           [exec]     	at com.liferay.portal.kernel.test.rule.AbstractTestRule$1.evaluate(AbstractTestRule.java:59)
           [exec]     	at org.junit.rules.RunRules.evaluate(RunRules.java:20)
           [exec]     	at com.liferay.arquillian.extension.junit.bridge.server.TestExecutorRunnable._execute(TestExecutorRunnable.java:181)
           [exec]     	at com.liferay.arquillian.extension.junit.bridge.server.TestExecutorRunnable.run(TestExecutorRunnable.java:95)
           [exec]     	at java.lang.Thread.run(Thread.java:745)
           [exec]     Caused by: java.lang.NoSuchMethodException: com.liferay.account.rest.resource.v1_0.test.AccountResourceTest$1.<init>()
           [exec]     	at java.lang.Class.getConstructor0(Class.java:3082)
           [exec]     	at java.lang.Class.newInstance(Class.java:412)
           [exec]     	... 31 more
           [exec] 
      

        Attachments

          Activity

            People

            Assignee:
            patricia.perez Patricia Perez
            Reporter:
            calvin.vo Calvin Vo
            Participants of an Issue:
            Recent user:
            Jason Pince
            Votes:
            0 Vote for this issue
            Watchers:
            0 Start watching this issue

              Dates

              Created:
              Updated:
              Resolved:
              Days since last comment:
              35 weeks, 5 days ago

                Packages

                Version Package
                7.0.0 DXP FP95
                7.0.X
                7.1.10 DXP FP17
                7.1.10.4 SP4
                7.1.X
                7.2.10 DXP FP5
                7.2.10.2 DXP SP2
                7.2.X
                7.3.1 CE GA2
                7.3.2 CE GA3
                7.3.10 DXP GA1
                Master