Details

      Description

        [exec]     test.dependencies.dir.name=dependencies
           [exec]     test.name=LocalFile.PortalSmoke#Smoke
           [exec]     test.poshi.script.validation=true
           [exec]     test.poshi.warnings.file.name=/opt/dev/projects/github/liferay-portal-7.0.x/poshi-warnings.xml
           [exec]     test.retry.command.wait.time=3
           [exec]     test.run.locally=false
           [exec]     test.skip.tear.down=false
           [exec]     timeout.explicit.wait=120
           [exec]     timeout.implicit.wait=3
           [exec] 
           [exec]     70 errors in POSHI
           [exec] 
           [exec] 
           [exec]     Invalid path name WCPreview
           [exec]     /opt/dev/projects/github/liferay-portal-7.0.x/portal-web/test/functional/com/liferay/portalweb/macros/WebContent.macro:1393
           [exec] 
           [exec]     Invalid path name SitePages
           [exec]     /opt/dev/projects/github/liferay-portal-7.0.x/portal-web/test/functional/com/liferay/portalweb/macros/Page.macro:283
           [exec] 
           [exec]     Invalid path name SitePages
           [exec]     /opt/dev/projects/github/liferay-portal-7.0.x/portal-web/test/functional/com/liferay/portalweb/macros/SitePageNavigator.macro:88
           [exec] 
           [exec]     Invalid path name SitePages
           [exec]     /opt/dev/projects/github/liferay-portal-7.0.x/portal-web/test/functional/com/liferay/portalweb/macros/Page.macro:352
           [exec] 
           [exec]     Invalid path name WCPreview
           [exec]     /opt/dev/projects/github/liferay-portal-7.0.x/portal-web/test/functional/com/liferay/portalweb/macros/WebContent.macro:1397
           [exec] 
           [exec]     Invalid path name SitePages
           [exec]     /opt/dev/projects/github/liferay-portal-7.0.x/portal-web/test/functional/com/liferay/portalweb/macros/Page.macro:859
           [exec] 
           [exec]     Invalid path name SitePages
           [exec]     /opt/dev/projects/github/liferay-portal-7.0.x/portal-web/test/functional/com/liferay/portalweb/macros/Page.macro:876
           [exec] 
           [exec]     Invalid path name SitePages
           [exec]     /opt/dev/projects/github/liferay-portal-7.0.x/portal-web/test/functional/com/liferay/portalweb/macros/Page.macro:1087
           [exec] 
           [exec]     Invalid path name SitePages
           [exec]     /opt/dev/projects/github/liferay-portal-7.0.x/portal-web/test/functional/com/liferay/portalweb/macros/Page.macro:214
           [exec] 
           [exec]     Invalid path name SitePages
           [exec]     /opt/dev/projects/github/liferay-portal-7.0.x/portal-web/test/functional/com/liferay/portalweb/macros/Page.macro:366
           [exec] 
           [exec]     Invalid path name SitePages
           [exec]     /opt/dev/projects/github/liferay-portal-7.0.x/portal-web/test/functional/com/liferay/portalweb/macros/Page.macro:893
           [exec] 
           [exec]     Invalid path name SitePages
           [exec]     /opt/dev/projects/github/liferay-portal-7.0.x/portal-web/test/functional/com/liferay/portalweb/macros/SitePageNavigator.macro:24
           [exec] 
           [exec]     Invalid path name SitePages
           [exec]     /opt/dev/projects/github/liferay-portal-7.0.x/portal-web/test/functional/com/liferay/portalweb/macros/SitePageNavigator.macro:96
           [exec] 
           [exec]     Invalid path name SitePages
           [exec]     /opt/dev/projects/github/liferay-portal-7.0.x/portal-web/test/functional/com/liferay/portalweb/macros/MessageboardsPortlet.macro:269
           [exec] 
           [exec]     Invalid path name SitePages
           [exec]     /opt/dev/projects/github/liferay-portal-7.0.x/portal-web/test/functional/com/liferay/portalweb/macros/SitePageNavigator.macro:45
           [exec] 
           [exec]     Invalid path name SitePages
           [exec]     /opt/dev/projects/github/liferay-portal-7.0.x/portal-web/test/functional/com/liferay/portalweb/macros/Page.macro:1077
           [exec] 
           [exec]     Invalid path name SitePages
           [exec]     /opt/dev/projects/github/liferay-portal-7.0.x/portal-web/test/functional/com/liferay/portalweb/macros/Page.macro:676
           [exec] 
           [exec]     Invalid path name SitePages
           [exec]     /opt/dev/projects/github/liferay-portal-7.0.x/portal-web/test/functional/com/liferay/portalweb/macros/Page.macro:829
           [exec] 
           [exec]     Invalid path name SitePages
           [exec]     /opt/dev/projects/github/liferay-portal-7.0.x/portal-web/test/functional/com/liferay/portalweb/macros/Mentions.macro:106
           [exec] 
           [exec]     Invalid path name SitePages
           [exec]     /opt/dev/projects/github/liferay-portal-7.0.x/portal-web/test/functional/com/liferay/portalweb/macros/ProductMenuHelper.macro:4
           [exec] 
           [exec]     Invalid path name SitePages
           [exec]     /opt/dev/projects/github/liferay-portal-7.0.x/portal-web/test/functional/com/liferay/portalweb/macros/Page.macro:1022
           [exec] 
           [exec]     Invalid path name SitePages
           [exec]     /opt/dev/projects/github/liferay-portal-7.0.x/portal-web/test/functional/com/liferay/portalweb/macros/Page.macro:210
           [exec] 
           [exec]     Invalid path name SitePages
           [exec]     /opt/dev/projects/github/liferay-portal-7.0.x/portal-web/test/functional/com/liferay/portalweb/macros/Page.macro:332
           [exec] 
           [exec]     Invalid path name SitePages
           [exec]     /opt/dev/projects/github/liferay-portal-7.0.x/portal-web/test/functional/com/liferay/portalweb/macros/Page.macro:895
           [exec] 
           [exec]     Invalid path name SitePages
           [exec]     /opt/dev/projects/github/liferay-portal-7.0.x/portal-web/test/functional/com/liferay/portalweb/macros/PermissionsInline.macro:166
           [exec] 
           [exec]     Invalid path name SitePages
           [exec]     /opt/dev/projects/github/liferay-portal-7.0.x/portal-web/test/functional/com/liferay/portalweb/macros/Staging.macro:1263
           [exec] 
           [exec]     Invalid path name SitePages
           [exec]     /opt/dev/projects/github/liferay-portal-7.0.x/portal-web/test/functional/com/liferay/portalweb/macros/Page.macro:364
           [exec] 
           [exec]     Invalid path name SitePages
           [exec]     /opt/dev/projects/github/liferay-portal-7.0.x/portal-web/test/functional/com/liferay/portalweb/macros/SitePageNavigator.macro:34
           [exec] 
           [exec]     Invalid path name WCPreview
           [exec]     /opt/dev/projects/github/liferay-portal-7.0.x/portal-web/test/functional/com/liferay/portalweb/macros/WebContent.macro:1403
           [exec] 
           [exec]     Invalid path name SitePages
           [exec]     /opt/dev/projects/github/liferay-portal-7.0.x/portal-web/test/functional/com/liferay/portalweb/macros/Page.macro:742
           [exec] 
           [exec]     Invalid path name SitePages
           [exec]     /opt/dev/projects/github/liferay-portal-7.0.x/portal-web/test/functional/com/liferay/portalweb/macros/SitePageNavigator.macro:45
           [exec] 
           [exec]     Invalid path name SitePages
           [exec]     /opt/dev/projects/github/liferay-portal-7.0.x/portal-web/test/functional/com/liferay/portalweb/macros/SitePageNavigator.macro:80
           [exec] 
           [exec]     Invalid path name SitePages
           [exec]     /opt/dev/projects/github/liferay-portal-7.0.x/portal-web/test/functional/com/liferay/portalweb/macros/Page.macro:899
           [exec] 
           [exec]     Invalid path name SitePages
           [exec]     /opt/dev/projects/github/liferay-portal-7.0.x/portal-web/test/functional/com/liferay/portalweb/macros/Page.macro:1018
           [exec] 
           [exec]     Invalid path name SitePages
           [exec]     /opt/dev/projects/github/liferay-portal-7.0.x/portal-web/test/functional/com/liferay/portalweb/macros/Page.macro:863
           [exec] 
           [exec]     Invalid path name SitePages
           [exec]     /opt/dev/projects/github/liferay-portal-7.0.x/portal-web/test/functional/com/liferay/portalweb/macros/ProductMenu.macro:22
           [exec] 
           [exec]     Invalid path name SitePages
           [exec]     /opt/dev/projects/github/liferay-portal-7.0.x/portal-web/test/functional/com/liferay/portalweb/macros/Page.macro:1082
           [exec] 
           [exec]     Invalid path name SitePages
           [exec]     /opt/dev/projects/github/liferay-portal-7.0.x/portal-web/test/functional/com/liferay/portalweb/macros/Page.macro:228
           [exec] 
           [exec]     Invalid path name SitePages
           [exec]     /opt/dev/projects/github/liferay-portal-7.0.x/portal-web/test/functional/com/liferay/portalweb/macros/Page.macro:653
           [exec] 
           [exec]     Invalid path name SitePages
           [exec]     /opt/dev/projects/github/liferay-portal-7.0.x/portal-web/test/functional/com/liferay/portalweb/macros/Page.macro:170
           [exec] 
           [exec]     Invalid path name SitePages
           [exec]     /opt/dev/projects/github/liferay-portal-7.0.x/portal-web/test/functional/com/liferay/portalweb/macros/PermissionsInline.macro:168
           [exec] 
           [exec]     Invalid path name SitePages
           [exec]     /opt/dev/projects/github/liferay-portal-7.0.x/portal-web/test/functional/com/liferay/portalweb/macros/Staging.macro:1291
           [exec] 
           [exec]     Invalid path name SitePages
           [exec]     /opt/dev/projects/github/liferay-portal-7.0.x/portal-web/test/functional/com/liferay/portalweb/macros/Page.macro:644
           [exec] 
           [exec]     Invalid path name SitePages
           [exec]     /opt/dev/projects/github/liferay-portal-7.0.x/portal-web/test/functional/com/liferay/portalweb/macros/ProductMenu.macro:20
           [exec] 
           [exec]     Invalid path name SitePages
           [exec]     /opt/dev/projects/github/liferay-portal-7.0.x/portal-web/test/functional/com/liferay/portalweb/macros/Page.macro:698
           [exec] 
           [exec]     Invalid path name SitePages
           [exec]     /opt/dev/projects/github/liferay-portal-7.0.x/portal-web/test/functional/com/liferay/portalweb/macros/SiteTemplates.macro:52
           [exec] 
           [exec]     Invalid path name SitePages
           [exec]     /opt/dev/projects/github/liferay-portal-7.0.x/portal-web/test/functional/com/liferay/portalweb/macros/Page.macro:815
           [exec] 
           [exec]     Invalid path name SitePages
           [exec]     /opt/dev/projects/github/liferay-portal-7.0.x/portal-web/test/functional/com/liferay/portalweb/macros/Page.macro:1026
           [exec] 
           [exec]     Invalid path name SitePages
           [exec]     /opt/dev/projects/github/liferay-portal-7.0.x/portal-web/test/functional/com/liferay/portalweb/macros/SitePageNavigator.macro:45
           [exec] 
           [exec]     Invalid path name SitePages
           [exec]     /opt/dev/projects/github/liferay-portal-7.0.x/portal-web/test/functional/com/liferay/portalweb/macros/Staging.macro:1289
           [exec] 
           [exec]     Invalid path name SitePages
           [exec]     /opt/dev/projects/github/liferay-portal-7.0.x/portal-web/test/functional/com/liferay/portalweb/macros/SitePageNavigator.macro:34
           [exec] 
           [exec]     Invalid path name SitePages
           [exec]     /opt/dev/projects/github/liferay-portal-7.0.x/portal-web/test/functional/com/liferay/portalweb/macros/Page.macro:880
           [exec] 
           [exec]     Invalid path name SitePages
           [exec]     /opt/dev/projects/github/liferay-portal-7.0.x/portal-web/test/functional/com/liferay/portalweb/macros/SitePageNavigator.macro:45
           [exec] 
           [exec]     Invalid path name SitePages
           [exec]     /opt/dev/projects/github/liferay-portal-7.0.x/portal-web/test/functional/com/liferay/portalweb/macros/Page.macro:674
           [exec] 
           [exec]     Invalid path name SitePages
           [exec]     /opt/dev/projects/github/liferay-portal-7.0.x/portal-web/test/functional/com/liferay/portalweb/macros/Page.macro:867
           [exec] 
           [exec]     Invalid path name SitePages
           [exec]     /opt/dev/projects/github/liferay-portal-7.0.x/portal-web/test/functional/com/liferay/portalweb/macros/SitePageNavigator.macro:24
           [exec] 
           [exec]     Invalid path name SitePages
           [exec]     /opt/dev/projects/github/liferay-portal-7.0.x/portal-web/test/functional/com/liferay/portalweb/macros/SitePageNavigator.macro:34
           [exec] 
           [exec]     Invalid path name SitePages
           [exec]     /opt/dev/projects/github/liferay-portal-7.0.x/portal-web/test/functional/com/liferay/portalweb/macros/SitePageNavigator.macro:16
           [exec] 
           [exec]     Invalid path name SitePages
           [exec]     /opt/dev/projects/github/liferay-portal-7.0.x/portal-web/test/functional/com/liferay/portalweb/macros/Staging.macro:1259
           [exec] 
           [exec]     Invalid path name SitePages
           [exec]     /opt/dev/projects/github/liferay-portal-7.0.x/portal-web/test/functional/com/liferay/portalweb/macros/Page.macro:172
           [exec] 
           [exec]     Invalid path name SitePages
           [exec]     /opt/dev/projects/github/liferay-portal-7.0.x/portal-web/test/functional/com/liferay/portalweb/macros/SitePageNavigator.macro:34
           [exec] 
           [exec]     Invalid path name SitePages
           [exec]     /opt/dev/projects/github/liferay-portal-7.0.x/portal-web/test/functional/com/liferay/portalweb/macros/SitePageNavigator.macro:16
           [exec] 
           [exec]     Invalid path name SitePages
           [exec]     /opt/dev/projects/github/liferay-portal-7.0.x/portal-web/test/functional/com/liferay/portalweb/macros/Mentions.macro:119
           [exec] 
           [exec] 
           [exec] 1 test completed, 1 failed
           [exec]     Invalid path name SitePages
           [exec]     /opt/dev/projects/github/liferay-portal-7.0.x/portal-web/test/functional/com/liferay/portalweb/macros/Staging.macro:1267
           [exec] 
           [exec]     Invalid path name SitePages
           [exec]     /opt/dev/projects/github/liferay-portal-7.0.x/portal-web/test/functional/com/liferay/portalweb/macros/SitePageNavigator.macro:96
           [exec] 
           [exec]     Invalid path name SitePages
           [exec]     /opt/dev/projects/github/liferay-portal-7.0.x/portal-web/test/functional/com/liferay/portalweb/macros/Page.macro:646
           [exec] 
           [exec]     Invalid path name SitePages
           [exec]     /opt/dev/projects/github/liferay-portal-7.0.x/portal-web/test/functional/com/liferay/portalweb/macros/Page.macro:872
           [exec] 
           [exec]     Invalid path name SitePages
           [exec]     /opt/dev/projects/github/liferay-portal-7.0.x/portal-web/test/functional/com/liferay/portalweb/macros/Page.macro:354
           [exec] 
           [exec]     Invalid path name SitePages
           [exec]     /opt/dev/projects/github/liferay-portal-7.0.x/portal-web/test/functional/com/liferay/portalweb/macros/Page.macro:467
           [exec] 
           [exec]     Invalid path name SitePages
           [exec]     /opt/dev/projects/github/liferay-portal-7.0.x/portal-web/test/functional/com/liferay/portalweb/macros/Page.macro:626
           [exec] 
           [exec] 
           [exec] 
           [exec] com.liferay.poshi.runner.PoshiRunner > initializationError FAILED
           [exec]     java.lang.Exception at PoshiRunner.java:65
           [exec] 
           [exec] > Task :runPoshi FAILED
           [exec] Gradle build finished at 2020-02-11 07:16:10.023.
           [exec] 3 actionable tasks: 2 executed, 1 up-to-date
           [exec] 
           [exec] See the profiling report at: file:///opt/dev/projects/github/liferay-portal-7.0.x/portal-web/build/reports/profile/profile-2020-02-10-23-16-00.html
           [exec] A fine-grained performance profile is available: use the --scan option.
           [exec] 
           [exec] 
           [exec] FAILURE: Build failed with an exception.
           [exec] 
           [exec] * What went wrong:
           [exec] Execution failed for task ':runPoshi'.
           [exec] > There were failing tests. See the report at: file:///opt/dev/projects/github/liferay-portal-7.0.x/portal-web/tests/index.html
           [exec] 
           [exec] * Try:
           [exec] Run with --stacktrace option to get the stack trace. Run with --info or --debug option to get more log output. Run with --scan to get full insights.
           [exec] 
           [exec] * Get more help at https://help.gradle.org
           [exec] 
           [exec] BUILD FAILED in 10s
           [exec] Result: 1
      

        Attachments

          Activity

            People

            • Votes:
              0 Vote for this issue
              Watchers:
              0 Start watching this issue

              Dates

              • Created:
                Updated:
                Resolved:
                Days since last comment:
                31 weeks, 6 days ago

                Packages

                Version Package