Uploaded image for project: 'PUBLIC - Liferay Portal Community Edition'
  1. PUBLIC - Liferay Portal Community Edition
  2. LPS-108577

LocalFile.ContentPagesWithFragmentConfiguration could not assert auto save message

    Description

    Full Jenkins Log

    Testray

    Poshi Summary

    [exec]     BUILD FAILED: Element is not present at "//div[contains(@class,'page-editor')]//li[contains(.,'Button')]"
         [exec]     /opt/dev/projects/github/liferay-portal/portal-web/test/functional/com/liferay/portalweb/macros/layout/pageeditor/PageEditor.macro[addFragment]:135
         [exec]     /opt/dev/projects/github/liferay-portal/portal-web/test/functional/com/liferay/portalweb/tests/enduser/wem/layout/contentpage/ContentPages.testcase[AddContentPageFromPageTemplate]:128
         [exec] 
         [exec] 
         [exec] com.liferay.poshi.runner.PoshiRunner > test[LocalFile.ContentPages#AddContentPageFromPageTemplate] STANDARD_ERROR
         [exec]     java.lang.Exception: Element is not present at "//div[contains(@class,'page-editor')]//li[contains(.,'Button')]"
         [exec]     	at com.liferay.poshi.runner.selenium.BaseWebDriverImpl$Condition.assertTrue(BaseWebDriverImpl.java:4419)
         [exec]     	at com.liferay.poshi.runner.selenium.BaseWebDriverImpl$Condition.waitFor(BaseWebDriverImpl.java:4454)
         [exec]     	at com.liferay.poshi.runner.selenium.BaseWebDriverImpl.waitForElementPresent(BaseWebDriverImpl.java:3170)
         [exec]     	at sun.reflect.GeneratedMethodAccessor10.invoke(Unknown Source)
         [exec]     	at sun.reflect.DelegatingMethodAccessorImpl.invoke(DelegatingMethodAccessorImpl.java:43)
         [exec]     	at java.lang.reflect.Method.invoke(Method.java:498)
         [exec]     	at com.liferay.poshi.runner.PoshiRunnerExecutor$1.call(PoshiRunnerExecutor.java:1195)
         [exec]     	at java.util.concurrent.FutureTask.run(FutureTask.java:266)
         [exec]     	at java.util.concurrent.ThreadPoolExecutor.runWorker(ThreadPoolExecutor.java:1142)
         [exec]     	at java.util.concurrent.ThreadPoolExecutor$Worker.run(ThreadPoolExecutor.java:617)
         [exec]     	at java.lang.Thread.run(Thread.java:745)
         [exec] 
         [exec] com.liferay.poshi.runner.PoshiRunner > test[LocalFile.ContentPages#AddContentPageFromPageTemplate] FAILED
         [exec]     java.lang.Exception
         [exec] 
         [exec] com.liferay.poshi.runner.PoshiRunner > test[LocalFile.ContentPages#AddContentPageWithOOTBFragment] STANDARD_OUT
         [exec] 
         [exec]     ###
         [exec]     ### LocalFile.ContentPages#AddContentPageWithOOTBFragment
         [exec]     ###
         [exec] 
         [exec] 
         [exec] com.liferay.poshi.runner.PoshiRunner > test[LocalFile.ContentPages#AddContentPageWithOOTBFragment] STANDARD_ERROR
         [exec]     Starting ChromeDriver 2.37.544315 (730aa6a5fdba159ac9f4c1e8cbc59bf1b5ce12b7) on port 25066
         [exec]     Only local connections are allowed.
         [exec]     Feb 12, 2020 4:25:08 AM org.openqa.selenium.remote.ProtocolHandshake createSession
         [exec]     INFO: Detected dialect: OSS
         [exec] 
         [exec] com.liferay.poshi.runner.PoshiRunner > test[LocalFile.ContentPages#AddContentPageWithOOTBFragment] STANDARD_OUT
         [exec]     Executing commands: curl -X POST -u 'test@liferay.com:test' -d 'parentGroupId=0' -d 'liveGroupId=0' -d 'nameMap={"en_US":"Test Site Name"}' -d 'descriptionMap={}' -d 'type=1' -d 'manualMembership=true' -d 'membershipRestriction=0' -d 'friendlyURL=' -d 'site=true' -d 'inheritContent=false' -d 'active=true' http://cloud-10-0-10-183.lax.liferay.com:8080/api/jsonws/group/add-group
         [exec]     Response: {"active":true,"classNameId":"20011","classPK":"39429","companyId":"38824","creatorUserId":"38877","description":"","descriptionCurrentValue":"","descriptiveName":"Test Site Name","friendlyURL":"\/test-site-name","groupId":"39429","groupKey":"Test Site Name","inheritContent":false,"liveGroupId":"0","manualMembership":true,"membershipRestriction":0,"mvccVersion":"0","name":"<?xml version='1.0' encoding='UTF-8'?><root available-locales=\"en_US\" default-locale=\"en_US\"><Name language-id=\"en_US\">Test Site Name<\/Name><\/root>","nameCurrentValue":"Test Site Name","parentGroupId":"0","remoteStagingGroupCount":0,"site":true,"treePath":"\/39429\/","type":1,"uuid":"079eaed3-bbe4-0d28-474d-808e43f26060"}Finished executing commands.
         [exec] 
         [exec]     Selecting configuration iframe
         [exec]     This is a test for LPS-95042. Liferay should come out of the box with fragments.
    

      Attachments

        Activity

          People

          Assignee:
          lu.liu Lu Liu
          Reporter:
          calvin.vo Calvin Vo
          Participants of an Issue:
          Recent user:
          Brian Wulbern
          Votes:
          0 Vote for this issue
          Watchers:
          0 Start watching this issue

            Dates

            Created:
            Updated:
            Resolved:
            Days since last comment:
            1 year, 2 weeks, 6 days ago

              Packages

              Version Package