Uploaded image for project: 'PUBLIC - Liferay Portal Community Edition'
  1. PUBLIC - Liferay Portal Community Edition
  2. LPS-108585

Modules Semantic Versioning failure in item-selector-api:baseline

    Details

      Description

      modules-semantic-versioning-jdk8/9 is failing here:

           [exec] > Task :apps:item-selector:item-selector-api:baseline FAILED
           [exec]   PACKAGE_NAME                                       DELTA      CUR_VER    BASE_VER   REC_VER    WARNINGS  
           [exec] = ================================================== ========== ========== ========== ========== ==========
           [exec]   com.liferay.item.selector.provider                 UNCHANGED  1.1.0      1.0.0      1.0.0      EXCESSIVE VERSION INCREASE
           [exec] 	-   version    1.0.0
           [exec] 	+   version    1.1.0
           [exec] [Baseline Report] Mode: diff (persisted)
      
           [exec] FAILURE: Build failed with an exception.
           [exec] 
           [exec] * What went wrong:
           [exec] Execution failed for task ':apps:item-selector:item-selector-api:baseline'.
           [exec] > Semantic versioning is incorrect while checking /opt/dev/projects/github/liferay-portal/tools/sdk/dist/com.liferay.item.selector.api-5.2.0.jar against /opt/dev/projects/github/liferay-portal/.gradle/caches/modules-2/files-2.1/com.liferay/com.liferay.item.selector.api/5.1.0/9013de93be8a499444cc0442c450d673858c3c51/com.liferay.item.selector.api-5.1.0.jar
           [exec] 
           [exec] * Try:
           [exec] Run with --info or --debug option to get more log output. Run with --scan to get full insights.
           [exec] 
           [exec] * Exception is:
           [exec] org.gradle.api.tasks.TaskExecutionException: Execution failed for task ':apps:item-selector:item-selector-api:baseline'.
      

        Attachments

          Activity

            People

            Assignee:
            yvonne.han Yvonne Han
            Reporter:
            kristin.onias Kristin Onias
            Participants of an Issue:
            Recent user:
            Jason Pince
            Votes:
            0 Vote for this issue
            Watchers:
            1 Start watching this issue

              Dates

              Created:
              Updated:
              Resolved:
              Days since last comment:
              37 weeks, 6 days ago

                Packages

                Version Package
                7.3.1 CE GA2
                7.3.2 CE GA3
                7.3.10 DXP GA1
                Master