Uploaded image for project: 'PUBLIC - Liferay Portal Community Edition'
  1. PUBLIC - Liferay Portal Community Edition
  2. LPS-109306

SQLDSLTest failed with comparison and assertion error

    Details

    • Type: Bug
    • Status: Closed
    • Resolution: Duplicate
    • Affects Version/s: Master
    • Fix Version/s: None
    • Component/s: Item Selector
    • Labels:
    • Fix Priority:
      5

      Description

      Full Jenkins Log

      Testray

       [exec] com.liferay.item.selector.web.internal.ItemSelectorImplTest > testGetItemSelectorParameters FAILED
           [exec]     org.junit.ComparisonFailure: expected:<media[,flickr]> but was:<media[_4,flickr_5]>
           [exec]         at org.junit.Assert.assertEquals(Assert.java:115)
           [exec]         at org.junit.Assert.assertEquals(Assert.java:144)
           [exec]         at com.liferay.item.selector.web.internal.ItemSelectorImplTest.testGetItemSelectorParameters(ItemSelectorImplTest.java:168)
           [exec]         at sun.reflect.NativeMethodAccessorImpl.invoke0(Native Method)
           [exec]         at sun.reflect.NativeMethodAccessorImpl.invoke(NativeMethodAccessorImpl.java:62)
           [exec]         at sun.reflect.DelegatingMethodAccessorImpl.invoke(DelegatingMethodAccessorImpl.java:43)
           [exec]         at java.lang.reflect.Method.invoke(Method.java:498)
           [exec]         at org.junit.runners.model.FrameworkMethod$1.runReflectiveCall(FrameworkMethod.java:50)
           [exec]         at org.junit.internal.runners.model.ReflectiveCallable.run(ReflectiveCallable.java:12)
           [exec]         at org.junit.runners.model.FrameworkMethod.invokeExplosively(FrameworkMethod.java:47)
           [exec]         at org.junit.internal.runners.statements.InvokeMethod.evaluate(InvokeMethod.java:17)
           [exec]         at org.junit.internal.runners.statements.RunBefores.evaluate(RunBefores.java:26)
           [exec]         at org.junit.runners.ParentRunner.runLeaf(ParentRunner.java:325)
           [exec]         at org.junit.runners.BlockJUnit4ClassRunner.runChild(BlockJUnit4ClassRunner.java:78)
           [exec]         at org.junit.runners.BlockJUnit4ClassRunner.runChild(BlockJUnit4ClassRunner.java:57)
           [exec]         at org.junit.runners.ParentRunner$3.run(ParentRunner.java:290)
           [exec]         at org.junit.runners.ParentRunner$1.schedule(ParentRunner.java:71)
           [exec]         at org.junit.runners.ParentRunner.runChildren(ParentRunner.java:288)
           [exec]         at org.junit.runners.ParentRunner.access$000(ParentRunner.java:58)
           [exec]         at org.junit.runners.ParentRunner$2.evaluate(ParentRunner.java:268)
           [exec]         at org.junit.runners.ParentRunner.run(ParentRunner.java:363)
           [exec]         at org.gradle.api.internal.tasks.testing.junit.JUnitTestClassExecutor.runTestClass(JUnitTestClassExecutor.java:110)
           [exec]         at org.gradle.api.internal.tasks.testing.junit.JUnitTestClassExecutor.execute(JUnitTestClassExecutor.java:58)
           [exec]         at org.gradle.api.internal.tasks.testing.junit.JUnitTestClassExecutor.execute(JUnitTestClassExecutor.java:38)
           [exec]         at org.gradle.api.internal.tasks.testing.junit.AbstractJUnitTestClassProcessor.processTestClass(AbstractJUnitTestClassProcessor.java:62)
           [exec]         at org.gradle.api.internal.tasks.testing.SuiteTestClassProcessor.processTestClass(SuiteTestClassProcessor.java:51)
           [exec]         at sun.reflect.NativeMethodAccessorImpl.invoke0(Native Method)
           [exec]         at sun.reflect.NativeMethodAccessorImpl.invoke(NativeMethodAccessorImpl.java:62)
           [exec]         at sun.reflect.DelegatingMethodAccessorImpl.invoke(DelegatingMethodAccessorImpl.java:43)
           [exec]         at java.lang.reflect.Method.invoke(Method.java:498)
           [exec]         at org.gradle.internal.dispatch.ReflectionDispatch.dispatch(ReflectionDispatch.java:36)
           [exec]         at org.gradle.internal.dispatch.ReflectionDispatch.dispatch(ReflectionDispatch.java:24)
           [exec]         at org.gradle.internal.dispatch.ContextClassLoaderDispatch.dispatch(ContextClassLoaderDispatch.java:33)
           [exec]         at org.gradle.internal.dispatch.ProxyDispatchAdapter$DispatchingInvocationHandler.invoke(ProxyDispatchAdapter.java:94)
           [exec]         at com.sun.proxy.$Proxy2.processTestClass(Unknown Source)
           [exec]         at org.gradle.api.internal.tasks.testing.worker.TestWorker.processTestClass(TestWorker.java:118)
           [exec]         at sun.reflect.NativeMethodAccessorImpl.invoke0(Native Method)
           [exec]         at sun.reflect.NativeMethodAccessorImpl.invoke(NativeMethodAccessorImpl.java:62)
           [exec]         at sun.reflect.DelegatingMethodAccessorImpl.invoke(DelegatingMethodAccessorImpl.java:43)
           [exec]         at java.lang.reflect.Method.invoke(Method.java:498)
           [exec]         at org.gradle.internal.dispatch.ReflectionDispatch.dispatch(ReflectionDispatch.java:36)
           [exec]         at org.gradle.internal.dispatch.ReflectionDispatch.dispatch(ReflectionDispatch.java:24)
           [exec]         at org.gradle.internal.remote.internal.hub.MessageHubBackedObjectConnection$DispatchWrapper.dispatch(MessageHubBackedObjectConnection.java:182)
           [exec]         at org.gradle.internal.remote.internal.hub.MessageHubBackedObjectConnection$DispatchWrapper.dispatch(MessageHubBackedObjectConnection.java:164)
           [exec]         at org.gradle.internal.remote.internal.hub.MessageHub$Handler.run(MessageHub.java:412)
           [exec]         at org.gradle.internal.concurrent.ExecutorPolicy$CatchAndRecordFailures.onExecute(ExecutorPolicy.java:64)
           [exec]         at org.gradle.internal.concurrent.ManagedExecutorImpl$1.run(ManagedExecutorImpl.java:48)
           [exec]         at java.util.concurrent.ThreadPoolExecutor.runWorker(ThreadPoolExecutor.java:1142)
           [exec]         at java.util.concurrent.ThreadPoolExecutor$Worker.run(ThreadPoolExecutor.java:617)
           [exec]         at org.gradle.internal.concurrent.ThreadFactoryImpl$ManagedThreadRunnable.run(ThreadFactoryImpl.java:56)
      
      [exec] com.liferay.item.selector.web.internal.util.ItemSelectorCriterionSerializerImplTest > testGetProperties FAILED
           [exec]     java.lang.AssertionError: {"desiredItemSelectorReturnTypes":"testurl_3","tags":["me","photo","picture"],"user":"anonymous"}
           [exec]         at org.junit.Assert.fail(Assert.java:88)
           [exec]         at org.junit.Assert.assertTrue(Assert.java:41)
           [exec]         at com.liferay.item.selector.web.internal.util.ItemSelectorCriterionSerializerImplTest._assert(ItemSelectorCriterionSerializerImplTest.java:100)
           [exec]         at com.liferay.item.selector.web.internal.util.ItemSelectorCriterionSerializerImplTest.testGetProperties(ItemSelectorCriterionSerializerImplTest.java:66)
           [exec]         at sun.reflect.NativeMethodAccessorImpl.invoke0(Native Method)
           [exec]         at sun.reflect.NativeMethodAccessorImpl.invoke(NativeMethodAccessorImpl.java:62)
           [exec]         at sun.reflect.DelegatingMethodAccessorImpl.invoke(DelegatingMethodAccessorImpl.java:43)
           [exec]         at java.lang.reflect.Method.invoke(Method.java:498)
           [exec]         at org.junit.runners.model.FrameworkMethod$1.runReflectiveCall(FrameworkMethod.java:50)
           [exec]         at org.junit.internal.runners.model.ReflectiveCallable.run(ReflectiveCallable.java:12)
           [exec]         at org.junit.runners.model.FrameworkMethod.invokeExplosively(FrameworkMethod.java:47)
           [exec]         at org.junit.internal.runners.statements.InvokeMethod.evaluate(InvokeMethod.java:17)
           [exec]         at org.junit.internal.runners.statements.RunBefores.evaluate(RunBefores.java:26)
           [exec]         at org.junit.runners.ParentRunner.runLeaf(ParentRunner.java:325)
           [exec]         at org.junit.runners.BlockJUnit4ClassRunner.runChild(BlockJUnit4ClassRunner.java:78)
           [exec]         at org.junit.runners.BlockJUnit4ClassRunner.runChild(BlockJUnit4ClassRunner.java:57)
           [exec]         at org.junit.runners.ParentRunner$3.run(ParentRunner.java:290)
           [exec]         at org.junit.runners.ParentRunner$1.schedule(ParentRunner.java:71)
           [exec]         at org.junit.runners.ParentRunner.runChildren(ParentRunner.java:288)
           [exec]         at org.junit.runners.ParentRunner.access$000(ParentRunner.java:58)
           [exec]         at org.junit.runners.ParentRunner$2.evaluate(ParentRunner.java:268)
           [exec]         at org.junit.runners.ParentRunner.run(ParentRunner.java:363)
           [exec]         at org.gradle.api.internal.tasks.testing.junit.JUnitTestClassExecutor.runTestClass(JUnitTestClassExecutor.java:110)
           [exec]         at org.gradle.api.internal.tasks.testing.junit.JUnitTestClassExecutor.execute(JUnitTestClassExecutor.java:58)
           [exec]         at org.gradle.api.internal.tasks.testing.junit.JUnitTestClassExecutor.execute(JUnitTestClassExecutor.java:38)
           [exec]         at org.gradle.api.internal.tasks.testing.junit.AbstractJUnitTestClassProcessor.processTestClass(AbstractJUnitTestClassProcessor.java:62)
           [exec]         at org.gradle.api.internal.tasks.testing.SuiteTestClassProcessor.processTestClass(SuiteTestClassProcessor.java:51)
           [exec]         at sun.reflect.NativeMethodAccessorImpl.invoke0(Native Method)
           [exec]         at sun.reflect.NativeMethodAccessorImpl.invoke(NativeMethodAccessorImpl.java:62)
           [exec]         at sun.reflect.DelegatingMethodAccessorImpl.invoke(DelegatingMethodAccessorImpl.java:43)
           [exec]         at java.lang.reflect.Method.invoke(Method.java:498)
           [exec]         at org.gradle.internal.dispatch.ReflectionDispatch.dispatch(ReflectionDispatch.java:36)
           [exec]         at org.gradle.internal.dispatch.ReflectionDispatch.dispatch(ReflectionDispatch.java:24)
           [exec]         at org.gradle.internal.dispatch.ContextClassLoaderDispatch.dispatch(ContextClassLoaderDispatch.java:33)
           [exec]         at org.gradle.internal.dispatch.ProxyDispatchAdapter$DispatchingInvocationHandler.invoke(ProxyDispatchAdapter.java:94)
           [exec]         at com.sun.proxy.$Proxy2.processTestClass(Unknown Source)
           [exec]         at org.gradle.api.internal.tasks.testing.worker.TestWorker.processTestClass(TestWorker.java:118)
           [exec]         at sun.reflect.NativeMethodAccessorImpl.invoke0(Native Method)
           [exec]         at sun.reflect.NativeMethodAccessorImpl.invoke(NativeMethodAccessorImpl.java:62)
           [exec]         at sun.reflect.DelegatingMethodAccessorImpl.invoke(DelegatingMethodAccessorImpl.java:43)
           [exec]         at java.lang.reflect.Method.invoke(Method.java:498)
           [exec]         at org.gradle.internal.dispatch.ReflectionDispatch.dispatch(ReflectionDispatch.java:36)
           [exec]         at org.gradle.internal.dispatch.ReflectionDispatch.dispatch(ReflectionDispatch.java:24)
           [exec]         at org.gradle.internal.remote.internal.hub.MessageHubBackedObjectConnection$DispatchWrapper.dispatch(MessageHubBackedObjectConnection.java:182)
           [exec]         at org.gradle.internal.remote.internal.hub.MessageHubBackedObjectConnection$DispatchWrapper.dispatch(MessageHubBackedObjectConnection.java:164)
           [exec]         at org.gradle.internal.remote.internal.hub.MessageHub$Handler.run(MessageHub.java:412)
           [exec]         at org.gradle.internal.concurrent.ExecutorPolicy$CatchAndRecordFailures.onExecute(ExecutorPolicy.java:64)
           [exec]         at org.gradle.internal.concurrent.ManagedExecutorImpl$1.run(ManagedExecutorImpl.java:48)
           [exec]         at java.util.concurrent.ThreadPoolExecutor.runWorker(ThreadPoolExecutor.java:1142)
           [exec]         at java.util.concurrent.ThreadPoolExecutor$Worker.run(ThreadPoolExecutor.java:617)
           [exec]         at org.gradle.internal.concurrent.ThreadFactoryImpl$ManagedThreadRunnable.run(ThreadFactoryImpl.java:56)
      

        Attachments

          Issue Links

            Activity

              People

              Assignee:
              yvonne.han Yvonne Han
              Reporter:
              calvin.vo Calvin Vo
              Participants of an Issue:
              Recent user:
              Yvonne Han
              Votes:
              0 Vote for this issue
              Watchers:
              0 Start watching this issue

                Dates

                Created:
                Updated:
                Resolved:
                Days since last comment:
                39 weeks, 4 days ago

                  Packages

                  Version Package