Uploaded image for project: 'PUBLIC - Liferay Portal Community Edition'
  1. PUBLIC - Liferay Portal Community Edition
  2. LPS-109352

FormRules failed with invalid element state

    Details

    • Type: Bug
    • Status: Closed
    • Resolution: No Longer Reproducible
    • Affects Version/s: Master
    • Fix Version/s: None
    • Component/s: Forms
    • Fix Priority:
      3
    • Sprint:
      Forms_7.3_19

      Description

      Full Jenkins Log

      Testray

      [exec]     BUILD FAILED: invalid element state: Element is not currently interactable and may not be manipulated
           [exec]       (Session info: chrome=65.0.3325.162)
           [exec]       (Driver info: chromedriver=2.37.544315 (730aa6a5fdba159ac9f4c1e8cbc59bf1b5ce12b7),platform=Linux 4.14.138-rancher x86_64) (WARNING: The server did not provide any stacktrace information)
           [exec]     Command duration or timeout: 0 milliseconds
           [exec]     Build info: version: '3.8.1', revision: '6e95a6684b', time: '2017-12-01T18:33:54.468Z'
           [exec]     System info: host: 'cloud-10-0-16-94.lax.liferay.com', ip: '127.0.0.1', os.name: 'Linux', os.arch: 'amd64', os.version: '4.14.138-rancher', java.version: '1.8.0_121'
           [exec]     Driver info: org.openqa.selenium.chrome.ChromeDriver
           [exec]     Capabilities {acceptInsecureCerts: false, acceptSslCerts: false, applicationCacheEnabled: false, browserConnectionEnabled: false, browserName: chrome, chrome: {chromedriverVersion: 2.37.544315 (730aa6a5fdba15..., userDataDir: /tmp/.org.chromium.Chromium...}, cssSelectorsEnabled: true, databaseEnabled: false, handlesAlerts: true, hasTouchScreen: false, javascriptEnabled: true, locationContextEnabled: true, mobileEmulationEnabled: false, nativeEvents: true, networkConnectionEnabled: false, pageLoadStrategy: normal, platform: LINUX, platformName: LINUX, rotatable: false, setWindowRect: true, takesHeapSnapshot: true, takesScreenshot: true, unexpectedAlertBehaviour: , unhandledPromptBehavior: , version: 65.0.3325.162, webStorageEnabled: true}
           [exec]     Session ID: 5ea4f0a10d00a1a37b914b99b41d7f9e
           [exec]     /opt/dev/projects/github/liferay-portal/portal-web/test/functional/com/liferay/portalweb/macros/FormFields.macro[editText]:185
           [exec]     /opt/dev/projects/github/liferay-portal/portal-web/test/functional/com/liferay/portalweb/tests/enduser/webformsanddatalists/forms/FormRules.testcase[ConfigureRequireRule]:332
           [exec] 
           [exec] 
           [exec] com.liferay.poshi.runner.PoshiRunner > test[LocalFile.FormRules#ConfigureRequireRule] STANDARD_ERROR
           [exec]     org.openqa.selenium.InvalidElementStateException: invalid element state: Element is not currently interactable and may not be manipulated
           [exec]       (Session info: chrome=65.0.3325.162)
           [exec]       (Driver info: chromedriver=2.37.544315 (730aa6a5fdba159ac9f4c1e8cbc59bf1b5ce12b7),platform=Linux 4.14.138-rancher x86_64) (WARNING: The server did not provide any stacktrace information)
           [exec]     Command duration or timeout: 0 milliseconds
           [exec]     Build info: version: '3.8.1', revision: '6e95a6684b', time: '2017-12-01T18:33:54.468Z'
           [exec]     System info: host: 'cloud-10-0-16-94.lax.liferay.com', ip: '127.0.0.1', os.name: 'Linux', os.arch: 'amd64', os.version: '4.14.138-rancher', java.version: '1.8.0_121'
           [exec]     Driver info: org.openqa.selenium.chrome.ChromeDriver
           [exec]     Capabilities {acceptInsecureCerts: false, acceptSslCerts: false, applicationCacheEnabled: false, browserConnectionEnabled: false, browserName: chrome, chrome: {chromedriverVersion: 2.37.544315 (730aa6a5fdba15..., userDataDir: /tmp/.org.chromium.Chromium...}, cssSelectorsEnabled: true, databaseEnabled: false, handlesAlerts: true, hasTouchScreen: false, javascriptEnabled: true, locationContextEnabled: true, mobileEmulationEnabled: false, nativeEvents: true, networkConnectionEnabled: false, pageLoadStrategy: normal, platform: LINUX, platformName: LINUX, rotatable: false, setWindowRect: true, takesHeapSnapshot: true, takesScreenshot: true, unexpectedAlertBehaviour: , unhandledPromptBehavior: , version: 65.0.3325.162, webStorageEnabled: true}
           [exec]     Session ID: 5ea4f0a10d00a1a37b914b99b41d7f9e
           [exec]     	at sun.reflect.NativeConstructorAccessorImpl.newInstance0(Native Method)
           [exec]     	at sun.reflect.NativeConstructorAccessorImpl.newInstance(NativeConstructorAccessorImpl.java:62)
           [exec]     	at sun.reflect.DelegatingConstructorAccessorImpl.newInstance(DelegatingConstructorAccessorImpl.java:45)
           [exec]     	at java.lang.reflect.Constructor.newInstance(Constructor.java:423)
           [exec]     	at org.openqa.selenium.remote.ErrorHandler.createThrowable(ErrorHandler.java:214)
           [exec]     	at org.openqa.selenium.remote.ErrorHandler.throwIfResponseFailed(ErrorHandler.java:166)
           [exec]     	at org.openqa.selenium.remote.http.JsonHttpResponseCodec.reconstructValue(JsonHttpResponseCodec.java:40)
           [exec]     	at org.openqa.selenium.remote.http.AbstractHttpResponseCodec.decode(AbstractHttpResponseCodec.java:80)
           [exec]     	at org.openqa.selenium.remote.http.AbstractHttpResponseCodec.decode(AbstractHttpResponseCodec.java:44)
           [exec]     	at org.openqa.selenium.remote.HttpCommandExecutor.execute(HttpCommandExecutor.java:164)
           [exec]     	at org.openqa.selenium.remote.service.DriverCommandExecutor.execute(DriverCommandExecutor.java:83)
           [exec]     	at org.openqa.selenium.remote.RemoteWebDriver.execute(RemoteWebDriver.java:601)
           [exec]     	at org.openqa.selenium.remote.RemoteWebElement.execute(RemoteWebElement.java:279)
           [exec]     	at org.openqa.selenium.remote.RemoteWebElement.clear(RemoteWebElement.java:118)
           [exec]     	at com.liferay.poshi.runner.selenium.RetryWebElementImpl.clear(RetryWebElementImpl.java:52)
           [exec]     	at com.liferay.poshi.runner.selenium.BaseWebDriverImpl.type(BaseWebDriverImpl.java:2849)
           [exec]     	at sun.reflect.NativeMethodAccessorImpl.invoke0(Native Method)
           [exec]     	at sun.reflect.NativeMethodAccessorImpl.invoke(NativeMethodAccessorImpl.java:62)
           [exec]     	at sun.reflect.DelegatingMethodAccessorImpl.invoke(DelegatingMethodAccessorImpl.java:43)
           [exec]     	at java.lang.reflect.Method.invoke(Method.java:498)
           [exec]     	at com.liferay.poshi.runner.PoshiRunnerExecutor$1.call(PoshiRunnerExecutor.java:1195)
           [exec]     	at java.util.concurrent.FutureTask.run(FutureTask.java:266)
           [exec]     	at java.util.concurrent.ThreadPoolExecutor.runWorker(ThreadPoolExecutor.java:1142)
           [exec]     	at java.util.concurrent.ThreadPoolExecutor$Worker.run(ThreadPoolExecutor.java:617)
           [exec]     	at java.lang.Thread.run(Thread.java:745)
           [exec] 
           [exec] com.liferay.poshi.runner.PoshiRunner > test[LocalFile.FormRules#ConfigureRequireRule] FAILED
           [exec]     org.openqa.selenium.InvalidElementStateException
      

        Attachments

          Activity

            People

            • Assignee:
              cleyton.magalhaes Cleyton Magalhaes
              Reporter:
              calvin.vo Calvin Vo
              Participants of an Issue:
              Recent user:
              Cleyton Magalhaes
            • Votes:
              0 Vote for this issue
              Watchers:
              0 Start watching this issue

              Dates

              • Created:
                Updated:
                Resolved:
                Days since last comment:
                31 weeks, 1 day ago

                Packages

                Version Package