Uploaded image for project: 'PUBLIC - Liferay Portal Community Edition'
  1. PUBLIC - Liferay Portal Community Edition
  2. LPS-109502

FragmentEntryLinkStagingTest failed with no layout/FrameEntryLinks exists with key

    Description

    Full Jenkins Log

    Testray

      [exec] com.liferay.fragment.staging.test.FragmentEntryLinkStagingTest > testFragmentEntryLinkCopiedWhenLocalStagingActivated FAILED
         [exec]     java.lang.AssertionError
         [exec]     	at org.junit.Assert.fail(Assert.java:86)
         [exec]     	at org.junit.Assert.assertTrue(Assert.java:41)
         [exec]     	at org.junit.Assert.assertNotNull(Assert.java:712)
         [exec]     	at org.junit.Assert.assertNotNull(Assert.java:722)
         [exec]     	at com.liferay.fragment.staging.test.FragmentEntryLinkStagingTest.testFragmentEntryLinkCopiedWhenLocalStagingActivated(FragmentEntryLinkStagingTest.java:101)
         [exec]     	at sun.reflect.NativeMethodAccessorImpl.invoke0(Native Method)
         [exec]     	at sun.reflect.NativeMethodAccessorImpl.invoke(NativeMethodAccessorImpl.java:62)
         [exec]     	at sun.reflect.DelegatingMethodAccessorImpl.invoke(DelegatingMethodAccessorImpl.java:43)
         [exec]     	at java.lang.reflect.Method.invoke(Method.java:498)
         [exec]     	at com.liferay.arquillian.extension.junit.bridge.server.TestExecutorRunnable$2.evaluate(TestExecutorRunnable.java:234)
         [exec]     	at org.junit.internal.runners.statements.RunBefores.evaluate(RunBefores.java:26)
         [exec]     	at com.liferay.portal.kernel.test.rule.AbstractTestRule$2.evaluate(AbstractTestRule.java:99)
         [exec]     	at com.liferay.portal.kernel.test.rule.AbstractTestRule$2.evaluate(AbstractTestRule.java:99)
         [exec]     	at com.liferay.portal.kernel.test.rule.AbstractTestRule$2.evaluate(AbstractTestRule.java:99)
         [exec]     	at com.liferay.portal.kernel.test.rule.AbstractTestRule$2.evaluate(AbstractTestRule.java:99)
         [exec]     	at com.liferay.portal.kernel.test.rule.AbstractTestRule$2.evaluate(AbstractTestRule.java:99)
         [exec]     	at com.liferay.portal.kernel.test.rule.TimeoutTestRule$1.evaluate(TimeoutTestRule.java:89)
         [exec]     	at org.junit.rules.RunRules.evaluate(RunRules.java:20)
         [exec]     	at com.liferay.arquillian.extension.junit.bridge.server.TestExecutorRunnable$1.evaluate(TestExecutorRunnable.java:143)
         [exec]     	at com.liferay.portal.kernel.test.rule.AbstractTestRule$1.evaluate(AbstractTestRule.java:59)
         [exec]     	at com.liferay.portal.kernel.test.rule.AbstractTestRule$1.evaluate(AbstractTestRule.java:59)
         [exec]     	at com.liferay.portal.kernel.test.rule.AbstractTestRule$1.evaluate(AbstractTestRule.java:59)
         [exec]     	at com.liferay.portal.kernel.test.rule.AbstractTestRule$1.evaluate(AbstractTestRule.java:59)
         [exec]     	at com.liferay.portal.kernel.test.rule.AbstractTestRule$1.evaluate(AbstractTestRule.java:59)
         [exec]     	at com.liferay.portal.kernel.test.rule.AbstractTestRule$1.evaluate(AbstractTestRule.java:59)
         [exec]     	at com.liferay.portal.kernel.test.rule.AbstractTestRule$1.evaluate(AbstractTestRule.java:59)
         [exec]     	at com.liferay.portal.kernel.test.rule.AbstractTestRule$1.evaluate(AbstractTestRule.java:59)
         [exec]     	at org.junit.rules.RunRules.evaluate(RunRules.java:20)
         [exec]     	at com.liferay.arquillian.extension.junit.bridge.server.TestExecutorRunnable._execute(TestExecutorRunnable.java:181)
         [exec]     	at com.liferay.arquillian.extension.junit.bridge.server.TestExecutorRunnable.run(TestExecutorRunnable.java:95)
         [exec]     	at java.lang.Thread.run(Thread.java:745)
    
    [exec] com.liferay.fragment.staging.test.FragmentEntryLinkStagingTest > testPublishFragmentEntryLink FAILED
         [exec]     com.liferay.portal.kernel.exception.NoSuchLayoutException: No Layout exists with the key {uuid=72e2a778-dfe5-0b5d-4fca-cd2c20c76163, groupId=50233, privateLayout=false}
         [exec]     	at com.liferay.portal.service.persistence.impl.LayoutPersistenceImpl.findByUUID_G_P(LayoutPersistenceImpl.java:684)
         [exec]     	at com.liferay.portal.service.impl.LayoutLocalServiceImpl.getLayoutByUuidAndGroupId(LayoutLocalServiceImpl.java:1386)
         [exec]     	at sun.reflect.NativeMethodAccessorImpl.invoke0(Native Method)
         [exec]     	at sun.reflect.NativeMethodAccessorImpl.invoke(NativeMethodAccessorImpl.java:62)
         [exec]     	at sun.reflect.DelegatingMethodAccessorImpl.invoke(DelegatingMethodAccessorImpl.java:43)
         [exec]     	at java.lang.reflect.Method.invoke(Method.java:498)
         [exec]     	at com.liferay.portal.service.impl.LayoutLocalServiceStagingAdvice$LayoutLocalServiceStagingInvocationHandler._invoke(LayoutLocalServiceStagingAdvice.java:806)
         [exec]     	at com.liferay.portal.service.impl.LayoutLocalServiceStagingAdvice$LayoutLocalServiceStagingInvocationHandler.invoke(LayoutLocalServiceStagingAdvice.java:668)
         [exec]     	at com.sun.proxy.$Proxy90.getLayoutByUuidAndGroupId(Unknown Source)
         [exec]     	at sun.reflect.NativeMethodAccessorImpl.invoke0(Native Method)
         [exec]     	at sun.reflect.NativeMethodAccessorImpl.invoke(NativeMethodAccessorImpl.java:62)
         [exec]     	at sun.reflect.DelegatingMethodAccessorImpl.invoke(DelegatingMethodAccessorImpl.java:43)
         [exec]     	at java.lang.reflect.Method.invoke(Method.java:498)
         [exec]     	at com.liferay.portal.spring.aop.AopMethodInvocationImpl.proceed(AopMethodInvocationImpl.java:50)
         [exec]     	at com.liferay.portal.spring.transaction.TransactionInterceptor.invoke(TransactionInterceptor.java:69)
         [exec]     	at com.liferay.portal.spring.aop.AopMethodInvocationImpl.proceed(AopMethodInvocationImpl.java:57)
         [exec]     	at com.liferay.portal.spring.aop.AopInvocationHandler.invoke(AopInvocationHandler.java:49)
         [exec]     	at com.sun.proxy.$Proxy90.getLayoutByUuidAndGroupId(Unknown Source)
         [exec]     	at com.liferay.portal.kernel.service.LayoutLocalServiceUtil.getLayoutByUuidAndGroupId(LayoutLocalServiceUtil.java:961)
         [exec]     	at com.liferay.fragment.staging.test.FragmentEntryLinkStagingTest.testPublishFragmentEntryLink(FragmentEntryLinkStagingTest.java:114)
         [exec]     	at sun.reflect.NativeMethodAccessorImpl.invoke0(Native Method)
         [exec]     	at sun.reflect.NativeMethodAccessorImpl.invoke(NativeMethodAccessorImpl.java:62)
         [exec]     	at sun.reflect.DelegatingMethodAccessorImpl.invoke(DelegatingMethodAccessorImpl.java:43)
         [exec]     	at java.lang.reflect.Method.invoke(Method.java:498)
         [exec]     	at com.liferay.arquillian.extension.junit.bridge.server.TestExecutorRunnable$2.evaluate(TestExecutorRunnable.java:234)
         [exec]     	at org.junit.internal.runners.statements.RunBefores.evaluate(RunBefores.java:26)
         [exec]     	at com.liferay.portal.kernel.test.rule.AbstractTestRule$2.evaluate(AbstractTestRule.java:99)
         [exec]     	at com.liferay.portal.kernel.test.rule.AbstractTestRule$2.evaluate(AbstractTestRule.java:99)
         [exec]     	at com.liferay.portal.kernel.test.rule.AbstractTestRule$2.evaluate(AbstractTestRule.java:99)
         [exec]     	at com.liferay.portal.kernel.test.rule.AbstractTestRule$2.evaluate(AbstractTestRule.java:99)
         [exec]     	at com.liferay.portal.kernel.test.rule.AbstractTestRule$2.evaluate(AbstractTestRule.java:99)
         [exec]     	at com.liferay.portal.kernel.test.rule.TimeoutTestRule$1.evaluate(TimeoutTestRule.java:89)
         [exec]     	at org.junit.rules.RunRules.evaluate(RunRules.java:20)
         [exec]     	at com.liferay.arquillian.extension.junit.bridge.server.TestExecutorRunnable$1.evaluate(TestExecutorRunnable.java:143)
         [exec]     	at com.liferay.portal.kernel.test.rule.AbstractTestRule$1.evaluate(AbstractTestRule.java:59)
         [exec]     	at com.liferay.portal.kernel.test.rule.AbstractTestRule$1.evaluate(AbstractTestRule.java:59)
         [exec]     	at com.liferay.portal.kernel.test.rule.AbstractTestRule$1.evaluate(AbstractTestRule.java:59)
         [exec]     	at com.liferay.portal.kernel.test.rule.AbstractTestRule$1.evaluate(AbstractTestRule.java:59)
         [exec]     	at com.liferay.portal.kernel.test.rule.AbstractTestRule$1.evaluate(AbstractTestRule.java:59)
         [exec]     	at com.liferay.portal.kernel.test.rule.AbstractTestRule$1.evaluate(AbstractTestRule.java:59)
         [exec]     	at com.liferay.portal.kernel.test.rule.AbstractTestRule$1.evaluate(AbstractTestRule.java:59)
         [exec]     	at com.liferay.portal.kernel.test.rule.AbstractTestRule$1.evaluate(AbstractTestRule.java:59)
         [exec]     	at org.junit.rules.RunRules.evaluate(RunRules.java:20)
         [exec]     	at com.liferay.arquillian.extension.junit.bridge.server.TestExecutorRunnable._execute(TestExecutorRunnable.java:181)
         [exec]     	at com.liferay.arquillian.extension.junit.bridge.server.TestExecutorRunnable.run(TestExecutorRunnable.java:95)
         [exec]     	at java.lang.Thread.run(Thread.java:745)
    
    [exec] com.liferay.fragment.staging.test.FragmentEntryLinkStagingTest > testValidateFragmentEntryAfterDeactivateStaging FAILED
         [exec]     com.liferay.fragment.exception.NoSuchEntryLinkException: No FragmentEntryLink exists with the key {uuid=7d1e1c99-cb40-de59-e19e-b35aca86685d, groupId=50290}
         [exec]     	at com.liferay.fragment.service.persistence.impl.FragmentEntryLinkPersistenceImpl.findByUUID_G(FragmentEntryLinkPersistenceImpl.java:671)
         [exec]     	at com.liferay.fragment.service.base.FragmentEntryLinkLocalServiceBaseImpl.getFragmentEntryLinkByUuidAndGroupId(FragmentEntryLinkLocalServiceBaseImpl.java:479)
         [exec]     	at sun.reflect.NativeMethodAccessorImpl.invoke0(Native Method)
         [exec]     	at sun.reflect.NativeMethodAccessorImpl.invoke(NativeMethodAccessorImpl.java:62)
         [exec]     	at sun.reflect.DelegatingMethodAccessorImpl.invoke(DelegatingMethodAccessorImpl.java:43)
         [exec]     	at java.lang.reflect.Method.invoke(Method.java:498)
         [exec]     	at com.liferay.portal.spring.aop.AopMethodInvocationImpl.proceed(AopMethodInvocationImpl.java:50)
         [exec]     	at com.liferay.portal.spring.transaction.TransactionInterceptor.invoke(TransactionInterceptor.java:69)
         [exec]     	at com.liferay.portal.spring.aop.AopMethodInvocationImpl.proceed(AopMethodInvocationImpl.java:57)
         [exec]     	at com.liferay.portal.spring.aop.AopInvocationHandler.invoke(AopInvocationHandler.java:49)
         [exec]     	at com.sun.proxy.$Proxy688.getFragmentEntryLinkByUuidAndGroupId(Unknown Source)
         [exec]     	at com.liferay.fragment.staging.test.FragmentEntryLinkStagingTest.testValidateFragmentEntryAfterDeactivateStaging(FragmentEntryLinkStagingTest.java:150)
         [exec]     	at sun.reflect.NativeMethodAccessorImpl.invoke0(Native Method)
         [exec]     	at sun.reflect.NativeMethodAccessorImpl.invoke(NativeMethodAccessorImpl.java:62)
         [exec]     	at sun.reflect.DelegatingMethodAccessorImpl.invoke(DelegatingMethodAccessorImpl.java:43)
         [exec]     	at java.lang.reflect.Method.invoke(Method.java:498)
         [exec]     	at com.liferay.arquillian.extension.junit.bridge.server.TestExecutorRunnable$2.evaluate(TestExecutorRunnable.java:234)
         [exec]     	at org.junit.internal.runners.statements.RunBefores.evaluate(RunBefores.java:26)
         [exec]     	at com.liferay.portal.kernel.test.rule.AbstractTestRule$2.evaluate(AbstractTestRule.java:99)
         [exec]     	at com.liferay.portal.kernel.test.rule.AbstractTestRule$2.evaluate(AbstractTestRule.java:99)
         [exec]     	at com.liferay.portal.kernel.test.rule.AbstractTestRule$2.evaluate(AbstractTestRule.java:99)
         [exec]     	at com.liferay.portal.kernel.test.rule.AbstractTestRule$2.evaluate(AbstractTestRule.java:99)
         [exec]     	at com.liferay.portal.kernel.test.rule.AbstractTestRule$2.evaluate(AbstractTestRule.java:99)
         [exec]     	at com.liferay.portal.kernel.test.rule.TimeoutTestRule$1.evaluate(TimeoutTestRule.java:89)
         [exec]     	at org.junit.rules.RunRules.evaluate(RunRules.java:20)
         [exec]     	at com.liferay.arquillian.extension.junit.bridge.server.TestExecutorRunnable$1.evaluate(TestExecutorRunnable.java:143)
         [exec]     	at com.liferay.portal.kernel.test.rule.AbstractTestRule$1.evaluate(AbstractTestRule.java:59)
         [exec]     	at com.liferay.portal.kernel.test.rule.AbstractTestRule$1.evaluate(AbstractTestRule.java:59)
         [exec]     	at com.liferay.portal.kernel.test.rule.AbstractTestRule$1.evaluate(AbstractTestRule.java:59)
         [exec]     	at com.liferay.portal.kernel.test.rule.AbstractTestRule$1.evaluate(AbstractTestRule.java:59)
         [exec]     	at com.liferay.portal.kernel.test.rule.AbstractTestRule$1.evaluate(AbstractTestRule.java:59)
         [exec]     	at com.liferay.portal.kernel.test.rule.AbstractTestRule$1.evaluate(AbstractTestRule.java:59)
         [exec]     	at com.liferay.portal.kernel.test.rule.AbstractTestRule$1.evaluate(AbstractTestRule.java:59)
         [exec]     	at com.liferay.portal.kernel.test.rule.AbstractTestRule$1.evaluate(AbstractTestRule.java:59)
         [exec]     	at org.junit.rules.RunRules.evaluate(RunRules.java:20)
         [exec]     	at com.liferay.arquillian.extension.junit.bridge.server.TestExecutorRunnable._execute(TestExecutorRunnable.java:181)
         [exec]     	at com.liferay.arquillian.extension.junit.bridge.server.TestExecutorRunnable.run(TestExecutorRunnable.java:95)
         [exec]     	at java.lang.Thread.run(Thread.java:745)
    

      Attachments

        Issue Links

          Activity

            People

            • Assignee:
              joyce.wang Joyce Wang
              Reporter:
              calvin.vo Calvin Vo
              Participants of an Issue:
              Recent user:
              Brian Wulbern
            • Votes:
              0 Vote for this issue
              Watchers:
              0 Start watching this issue

              Dates

              • Created:
                Updated:
                Resolved:
                Days since last comment:
                22 weeks, 6 days ago

                Packages

                Version Package
                Master