Uploaded image for project: 'PUBLIC - Liferay Portal Community Edition'
  1. PUBLIC - Liferay Portal Community Edition
  2. LPS-109888

Duplicate entry '10155-1-0-com_liferay_portal_workflow_task_web_portlet_MyWorkflo' for key 'IX_CB778855' being thrown on CI

    Details

    • Type: Bug
    • Status: Closed
    • Resolution: Duplicate
    • Affects Version/s: Master
    • Fix Version/s: None
    • Labels:
      None
    • Fix Priority:
      3

      Description

      Testray history

      Jenkins logs

      BUILD FAILED: 
           [exec]     ##
           [exec]     ## 1 Liferay Exception was thrown
           [exec]     ##
           [exec] 
           [exec]     LIFERAY_ERROR: Duplicate entry '10155-1-0-com_liferay_portal_workflow_task_web_portlet_MyWorkflo' for key 'IX_CB778855'
           [exec] 
           [exec] 
           [exec]     /opt/dev/projects/github/liferay-portal/portal-web/test/functional/com/liferay/portalweb/tests/coreinfrastructure/upgrades/PortalSmokeUpgrade.testcase[ViewPortalSmokeArchive621021]:153
           [exec] 
           [exec] 
           [exec] com.liferay.poshi.runner.PoshiRunner > test[LocalFile.PortalSmokeUpgrade#ViewPortalSmokeArchive621021] STANDARD_ERROR
           [exec]     java.lang.Exception: 
           [exec]     ##
           [exec]     ## 1 Liferay Exception was thrown
           [exec]     ##
           [exec] 
           [exec]     LIFERAY_ERROR: Duplicate entry '10155-1-0-com_liferay_portal_workflow_task_web_portlet_MyWorkflo' for key 'IX_CB778855'
           [exec] 
           [exec] 
           [exec]     	at com.liferay.poshi.runner.selenium.LiferaySeleniumHelper.assertNoPoshiWarnings(LiferaySeleniumHelper.java:298)
           [exec]     	at com.liferay.poshi.runner.PoshiRunner.test(PoshiRunner.java:182)
           [exec]     	at sun.reflect.NativeMethodAccessorImpl.invoke0(Native Method)
           [exec]     	at sun.reflect.NativeMethodAccessorImpl.invoke(NativeMethodAccessorImpl.java:62)
           [exec]     	at sun.reflect.DelegatingMethodAccessorImpl.invoke(DelegatingMethodAccessorImpl.java:43)
           [exec]     	at java.lang.reflect.Method.invoke(Method.java:498)
           [exec]     	at org.junit.runners.model.FrameworkMethod$1.runReflectiveCall(FrameworkMethod.java:50)
           [exec]     	at org.junit.internal.runners.model.ReflectiveCallable.run(ReflectiveCallable.java:12)
           [exec]     	at org.junit.runners.model.FrameworkMethod.invokeExplosively(FrameworkMethod.java:47)
           [exec]     	at org.junit.internal.runners.statements.InvokeMethod.evaluate(InvokeMethod.java:17)
           [exec]     	at org.junit.internal.runners.statements.RunBefores.evaluate(RunBefores.java:26)
           [exec]     	at org.junit.internal.runners.statements.RunAfters.evaluate(RunAfters.java:27)
           [exec]     	at com.liferay.poshi.runner.PoshiRunner$RetryTestRule$RetryStatement.evaluate(PoshiRunner.java:292)
           [exec]     	at org.junit.rules.RunRules.evaluate(RunRules.java:20)
           [exec]     	at org.junit.runners.ParentRunner.runLeaf(ParentRunner.java:325)
           [exec]     	at org.junit.runners.BlockJUnit4ClassRunner.runChild(BlockJUnit4ClassRunner.java:78)
           [exec]     	at org.junit.runners.BlockJUnit4ClassRunner.runChild(BlockJUnit4ClassRunner.java:57)
           [exec]     	at org.junit.runners.ParentRunner$3.run(ParentRunner.java:290)
           [exec]     	at org.junit.runners.ParentRunner$1.schedule(ParentRunner.java:71)
           [exec]     	at org.junit.runners.ParentRunner.runChildren(ParentRunner.java:288)
           [exec]     	at org.junit.runners.ParentRunner.access$000(ParentRunner.java:58)
           [exec]     	at org.junit.runners.ParentRunner$2.evaluate(ParentRunner.java:268)
           [exec]     	at org.junit.runners.ParentRunner.run(ParentRunner.java:363)
           [exec]     	at org.junit.runners.Suite.runChild(Suite.java:128)
           [exec]     	at org.junit.runners.Suite.runChild(Suite.java:27)
           [exec]     	at org.junit.runners.ParentRunner$3.run(ParentRunner.java:290)
           [exec]     	at org.junit.runners.ParentRunner$1.schedule(ParentRunner.java:71)
           [exec]     	at org.junit.runners.ParentRunner.runChildren(ParentRunner.java:288)
           [exec]     	at org.junit.runners.ParentRunner.access$000(ParentRunner.java:58)
           [exec]     	at org.junit.runners.ParentRunner$2.evaluate(ParentRunner.java:268)
           [exec]     	at org.junit.runners.ParentRunner.run(ParentRunner.java:363)
           [exec]     	at org.gradle.api.internal.tasks.testing.junit.JUnitTestClassExecutor.runTestClass(JUnitTestClassExecutor.java:110)
           [exec]     	at org.gradle.api.internal.tasks.testing.junit.JUnitTestClassExecutor.execute(JUnitTestClassExecutor.java:58)
           [exec]     	at org.gradle.api.internal.tasks.testing.junit.JUnitTestClassExecutor.execute(JUnitTestClassExecutor.java:38)
           [exec]     	at org.gradle.api.internal.tasks.testing.junit.AbstractJUnitTestClassProcessor.processTestClass(AbstractJUnitTestClassProcessor.java:62)
           [exec]     	at org.gradle.api.internal.tasks.testing.SuiteTestClassProcessor.processTestClass(SuiteTestClassProcessor.java:51)
           [exec]     	at sun.reflect.NativeMethodAccessorImpl.invoke0(Native Method)
           [exec]     	at sun.reflect.NativeMethodAccessorImpl.invoke(NativeMethodAccessorImpl.java:62)
           [exec]     	at sun.reflect.DelegatingMethodAccessorImpl.invoke(DelegatingMethodAccessorImpl.java:43)
           [exec]     	at java.lang.reflect.Method.invoke(Method.java:498)
           [exec]     	at org.gradle.internal.dispatch.ReflectionDispatch.dispatch(ReflectionDispatch.java:36)
           [exec]     	at org.gradle.internal.dispatch.ReflectionDispatch.dispatch(ReflectionDispatch.java:24)
           [exec]     	at org.gradle.internal.dispatch.ContextClassLoaderDispatch.dispatch(ContextClassLoaderDispatch.java:33)
           [exec]     	at org.gradle.internal.dispatch.ProxyDispatchAdapter$DispatchingInvocationHandler.invoke(ProxyDispatchAdapter.java:94)
           [exec]     	at com.sun.proxy.$Proxy2.processTestClass(Unknown Source)
           [exec]     	at org.gradle.api.internal.tasks.testing.worker.TestWorker.processTestClass(TestWorker.java:118)
           [exec]     	at sun.reflect.NativeMethodAccessorImpl.invoke0(Native Method)
           [exec]     	at sun.reflect.NativeMethodAccessorImpl.invoke(NativeMethodAccessorImpl.java:62)
           [exec]     	at sun.reflect.DelegatingMethodAccessorImpl.invoke(DelegatingMethodAccessorImpl.java:43)
           [exec]     	at java.lang.reflect.Method.invoke(Method.java:498)
           [exec]     	at org.gradle.internal.dispatch.ReflectionDispatch.dispatch(ReflectionDispatch.java:36)
           [exec]     	at org.gradle.internal.dispatch.ReflectionDispatch.dispatch(ReflectionDispatch.java:24)
           [exec]     	at org.gradle.internal.remote.internal.hub.MessageHubBackedObjectConnection$DispatchWrapper.dispatch(MessageHubBackedObjectConnection.java:182)
           [exec]     	at org.gradle.internal.remote.internal.hub.MessageHubBackedObjectConnection$DispatchWrapper.dispatch(MessageHubBackedObjectConnection.java:164)
           [exec]     	at org.gradle.internal.remote.internal.hub.MessageHub$Handler.run(MessageHub.java:412)
           [exec]     	at org.gradle.internal.concurrent.ExecutorPolicy$CatchAndRecordFailures.onExecute(ExecutorPolicy.java:64)
           [exec]     	at org.gradle.internal.concurrent.ManagedExecutorImpl$1.run(ManagedExecutorImpl.java:48)
           [exec]     	at java.util.concurrent.ThreadPoolExecutor.runWorker(ThreadPoolExecutor.java:1142)
           [exec]     	at java.util.concurrent.ThreadPoolExecutor$Worker.run(ThreadPoolExecutor.java:617)
           [exec]     	at org.gradle.internal.concurrent.ThreadFactoryImpl$ManagedThreadRunnable.run(ThreadFactoryImpl.java:56)
           [exec]     	at java.lang.Thread.run(Thread.java:745)
           [exec] 
           [exec] com.liferay.poshi.runner.PoshiRunner > test[LocalFile.PortalSmokeUpgrade#ViewPortalSmokeArchive621021] FAILED
           [exec]     java.lang.Exception at PoshiRunner.java:182
      

       

        Attachments

          Issue Links

            Activity

              People

              Assignee:
              support-lep@liferay.com SE Support
              Reporter:
              dennys.barros.1 Dennys Barros.1 (Inactive)
              Participants of an Issue:
              Recent user:
              Dennys Barros.1 (Inactive)
              Votes:
              0 Vote for this issue
              Watchers:
              0 Start watching this issue

                Dates

                Created:
                Updated:
                Resolved:
                Days since last comment:
                2 years, 16 weeks, 4 days ago

                  Packages

                  Version Package