Uploaded image for project: 'PUBLIC - Liferay Portal Community Edition'
  1. PUBLIC - Liferay Portal Community Edition
  2. LPS-110682

MasterLayoutsImporterTest failed with AssertionError

    Details

      Description

      Testray

      Jenkins

       [exec] com.liferay.layout.page.template.internal.importer.test.MasterLayoutsImporterTest > testImportMasterLayoutDropZoneAllowedFragments FAILED
           [exec]     java.lang.AssertionError: expected:<IMPORTED> but was:<INVALID>
           [exec]     	at org.junit.Assert.fail(Assert.java:88)
           [exec]     	at org.junit.Assert.failNotEquals(Assert.java:834)
           [exec]     	at org.junit.Assert.assertEquals(Assert.java:118)
           [exec]     	at org.junit.Assert.assertEquals(Assert.java:144)
           [exec]     	at com.liferay.layout.page.template.internal.importer.test.MasterLayoutsImporterTest._importLayoutPageTemplateEntry(MasterLayoutsImporterTest.java:235)
           [exec]     	at com.liferay.layout.page.template.internal.importer.test.MasterLayoutsImporterTest.testImportMasterLayoutDropZoneAllowedFragments(MasterLayoutsImporterTest.java:97)
           [exec]     	at sun.reflect.NativeMethodAccessorImpl.invoke0(Native Method)
           [exec]     	at sun.reflect.NativeMethodAccessorImpl.invoke(NativeMethodAccessorImpl.java:62)
           [exec]     	at sun.reflect.DelegatingMethodAccessorImpl.invoke(DelegatingMethodAccessorImpl.java:43)
           [exec]     	at java.lang.reflect.Method.invoke(Method.java:498)
           [exec]     	at com.liferay.arquillian.extension.junit.bridge.server.TestExecutorRunnable$2.evaluate(TestExecutorRunnable.java:234)
           [exec]     	at org.junit.internal.runners.statements.RunBefores.evaluate(RunBefores.java:26)
           [exec]     	at com.liferay.portal.kernel.test.rule.AbstractTestRule$2.evaluate(AbstractTestRule.java:99)
           [exec]     	at com.liferay.portal.kernel.test.rule.AbstractTestRule$2.evaluate(AbstractTestRule.java:99)
           [exec]     	at com.liferay.portal.kernel.test.rule.AbstractTestRule$2.evaluate(AbstractTestRule.java:99)
           [exec]     	at com.liferay.portal.kernel.test.rule.AbstractTestRule$2.evaluate(AbstractTestRule.java:99)
           [exec]     	at com.liferay.portal.kernel.test.rule.AbstractTestRule$2.evaluate(AbstractTestRule.java:99)
           [exec]     	at com.liferay.portal.kernel.test.rule.AbstractTestRule$2.evaluate(AbstractTestRule.java:99)
           [exec]     	at com.liferay.portal.kernel.test.rule.TimeoutTestRule$1.evaluate(TimeoutTestRule.java:89)
           [exec]     	at org.junit.rules.RunRules.evaluate(RunRules.java:20)
           [exec]     	at com.liferay.arquillian.extension.junit.bridge.server.TestExecutorRunnable$1.evaluate(TestExecutorRunnable.java:143)
           [exec]     	at com.liferay.portal.kernel.test.rule.AbstractTestRule$1.evaluate(AbstractTestRule.java:59)
           [exec]     	at com.liferay.portal.kernel.test.rule.AbstractTestRule$1.evaluate(AbstractTestRule.java:59)
           [exec]     	at com.liferay.portal.kernel.test.rule.AbstractTestRule$1.evaluate(AbstractTestRule.java:59)
           [exec]     	at com.liferay.portal.kernel.test.rule.AbstractTestRule$1.evaluate(AbstractTestRule.java:59)
           [exec]     	at com.liferay.portal.kernel.test.rule.AbstractTestRule$1.evaluate(AbstractTestRule.java:59)
           [exec]     	at com.liferay.portal.kernel.test.rule.AbstractTestRule$1.evaluate(AbstractTestRule.java:59)
           [exec]     	at com.liferay.portal.kernel.test.rule.AbstractTestRule$1.evaluate(AbstractTestRule.java:59)
           [exec]     	at com.liferay.portal.kernel.test.rule.AbstractTestRule$1.evaluate(AbstractTestRule.java:59)
           [exec]     	at org.junit.rules.RunRules.evaluate(RunRules.java:20)
           [exec]     	at com.liferay.arquillian.extension.junit.bridge.server.TestExecutorRunnable._execute(TestExecutorRunnable.java:181)
           [exec]     	at com.liferay.arquillian.extension.junit.bridge.server.TestExecutorRunnable.run(TestExecutorRunnable.java:95)
           [exec]     	at java.lang.Thread.run(Thread.java:745)
      

        Attachments

          Issue Links

            Activity

              People

              Assignee:
              yang.cao Yang Cao
              Reporter:
              calvin.vo Calvin Vo
              Participants of an Issue:
              Recent user:
              Jason Pince
              Votes:
              0 Vote for this issue
              Watchers:
              0 Start watching this issue

                Dates

                Created:
                Updated:
                Resolved:
                Days since last comment:
                36 weeks, 4 days ago

                  Packages

                  Version Package
                  7.3.1 CE GA2
                  7.3.2 CE GA3
                  7.3.10 DXP GA1
                  Master