Uploaded image for project: 'PUBLIC - Liferay Portal Community Edition'
  1. PUBLIC - Liferay Portal Community Edition
  2. LPS-112042

ContentPagesWithFragmentConfiguration failed with ElementNotInteractableException

Description

    Testray

    Jenkins

    [exec]     BUILD FAILED: unknown error: Element is not clickable at point (77, 948)
         [exec]       (Session info: chrome=65.0.3325.162)
         [exec]       (Driver info: chromedriver=2.37.544315 (730aa6a5fdba159ac9f4c1e8cbc59bf1b5ce12b7),platform=Linux 4.14.138-rancher x86_64) (WARNING: The server did not provide any stacktrace information)
         [exec]     Command duration or timeout: 0 milliseconds
         [exec]     Build info: version: '3.8.1', revision: '6e95a6684b', time: '2017-12-01T18:33:54.468Z'
         [exec]     System info: host: 'cloud-10-0-110-40.lax.liferay.com', ip: '127.0.0.1', os.name: 'Linux', os.arch: 'amd64', os.version: '4.14.138-rancher', java.version: '1.8.0_121'
         [exec]     Driver info: org.openqa.selenium.chrome.ChromeDriver
         [exec]     Capabilities {acceptInsecureCerts: false, acceptSslCerts: false, applicationCacheEnabled: false, browserConnectionEnabled: false, browserName: chrome, chrome: {chromedriverVersion: 2.37.544315 (730aa6a5fdba15..., userDataDir: /tmp/.org.chromium.Chromium...}, cssSelectorsEnabled: true, databaseEnabled: false, handlesAlerts: true, hasTouchScreen: false, javascriptEnabled: true, locationContextEnabled: true, mobileEmulationEnabled: false, nativeEvents: true, networkConnectionEnabled: false, pageLoadStrategy: normal, platform: LINUX, platformName: LINUX, rotatable: false, setWindowRect: true, takesHeapSnapshot: true, takesScreenshot: true, unexpectedAlertBehaviour: , unhandledPromptBehavior: , version: 65.0.3325.162, webStorageEnabled: true}
         [exec]     Session ID: 2d6c8468493966abc14727b355151ff2
         [exec]     /opt/dev/projects/github/liferay-portal/portal-web/test/functional/com/liferay/portalweb/macros/layout/pageeditor/PageEditorConfiguration.macro[changeConfigSelection]:30
         [exec]     /opt/dev/projects/github/liferay-portal/portal-web/test/functional/com/liferay/portalweb/tests/enduser/wem/layout/contentpage/ContentPagesWithFragmentConfiguration.testcase[AddSelectConfigurationFragmentToContentPage]:218
         [exec] 
         [exec] 
         [exec] com.liferay.poshi.runner.PoshiRunner > test[LocalFile.ContentPagesWithFragmentConfiguration#AddSelectConfigurationFragmentToContentPage] STANDARD_ERROR
         [exec]     org.openqa.selenium.ElementNotInteractableException: unknown error: Element is not clickable at point (77, 948)
         [exec]       (Session info: chrome=65.0.3325.162)
         [exec]       (Driver info: chromedriver=2.37.544315 (730aa6a5fdba159ac9f4c1e8cbc59bf1b5ce12b7),platform=Linux 4.14.138-rancher x86_64) (WARNING: The server did not provide any stacktrace information)
         [exec]     Command duration or timeout: 0 milliseconds
         [exec]     Build info: version: '3.8.1', revision: '6e95a6684b', time: '2017-12-01T18:33:54.468Z'
         [exec]     System info: host: 'cloud-10-0-110-40.lax.liferay.com', ip: '127.0.0.1', os.name: 'Linux', os.arch: 'amd64', os.version: '4.14.138-rancher', java.version: '1.8.0_121'
         [exec]     Driver info: org.openqa.selenium.chrome.ChromeDriver
         [exec]     Capabilities {acceptInsecureCerts: false, acceptSslCerts: false, applicationCacheEnabled: false, browserConnectionEnabled: false, browserName: chrome, chrome: {chromedriverVersion: 2.37.544315 (730aa6a5fdba15..., userDataDir: /tmp/.org.chromium.Chromium...}, cssSelectorsEnabled: true, databaseEnabled: false, handlesAlerts: true, hasTouchScreen: false, javascriptEnabled: true, locationContextEnabled: true, mobileEmulationEnabled: false, nativeEvents: true, networkConnectionEnabled: false, pageLoadStrategy: normal, platform: LINUX, platformName: LINUX, rotatable: false, setWindowRect: true, takesHeapSnapshot: true, takesScreenshot: true, unexpectedAlertBehaviour: , unhandledPromptBehavior: , version: 65.0.3325.162, webStorageEnabled: true}
         [exec]     Session ID: 2d6c8468493966abc14727b355151ff2
         [exec]     	at com.liferay.poshi.runner.selenium.ChromeWebDriverImpl.click(ChromeWebDriverImpl.java:52)
         [exec]     	at sun.reflect.GeneratedMethodAccessor16.invoke(Unknown Source)
         [exec]     	at sun.reflect.DelegatingMethodAccessorImpl.invoke(DelegatingMethodAccessorImpl.java:43)
         [exec]     	at java.lang.reflect.Method.invoke(Method.java:498)
         [exec]     	at com.liferay.poshi.runner.PoshiRunnerExecutor$1.call(PoshiRunnerExecutor.java:1198)
         [exec]     	at java.util.concurrent.FutureTask.run(FutureTask.java:266)
         [exec]     	at java.util.concurrent.ThreadPoolExecutor.runWorker(ThreadPoolExecutor.java:1142)
         [exec]     	at java.util.concurrent.ThreadPoolExecutor$Worker.run(ThreadPoolExecutor.java:617)
         [exec]     	at java.lang.Thread.run(Thread.java:745)
         [exec]     Caused by: org.openqa.selenium.WebDriverException: unknown error: Element is not clickable at point (77, 948)
         [exec]       (Session info: chrome=65.0.3325.162)
         [exec]       (Driver info: chromedriver=2.37.544315 (730aa6a5fdba159ac9f4c1e8cbc59bf1b5ce12b7),platform=Linux 4.14.138-rancher x86_64) (WARNING: The server did not provide any stacktrace information)
         [exec]     Command duration or timeout: 0 milliseconds
         [exec]     Build info: version: '3.8.1', revision: '6e95a6684b', time: '2017-12-01T18:33:54.468Z'
         [exec]     System info: host: 'cloud-10-0-110-40.lax.liferay.com', ip: '127.0.0.1', os.name: 'Linux', os.arch: 'amd64', os.version: '4.14.138-rancher', java.version: '1.8.0_121'
         [exec]     Driver info: org.openqa.selenium.chrome.ChromeDriver
         [exec]     Capabilities {acceptInsecureCerts: false, acceptSslCerts: false, applicationCacheEnabled: false, browserConnectionEnabled: false, browserName: chrome, chrome: {chromedriverVersion: 2.37.544315 (730aa6a5fdba15..., userDataDir: /tmp/.org.chromium.Chromium...}, cssSelectorsEnabled: true, databaseEnabled: false, handlesAlerts: true, hasTouchScreen: false, javascriptEnabled: true, locationContextEnabled: true, mobileEmulationEnabled: false, nativeEvents: true, networkConnectionEnabled: false, pageLoadStrategy: normal, platform: LINUX, platformName: LINUX, rotatable: false, setWindowRect: true, takesHeapSnapshot: true, takesScreenshot: true, unexpectedAlertBehaviour: , unhandledPromptBehavior: , version: 65.0.3325.162, webStorageEnabled: true}
    

    Attachments

      Issue Links

        Activity

          People

            david.gutierrez David Gutiérrez Mesa
            calvin.vo Calvin Vo
            Kiyoshi Lee Kiyoshi Lee
            David Gutiérrez Mesa David Gutiérrez Mesa
            Votes:
            0 Vote for this issue
            Watchers:
            0 Start watching this issue

            Dates

              Created:
              Updated:
              Resolved:
              2 years, 23 weeks, 5 days ago

              Packages

                Version Package
                7.3.10 DXP GA1
                Master