Details

      Description

      Testray

      Jenkins

          [junit] Running com.liferay.portal.kernel.util.ThreadLocalDistributorTest
          [junit] Testsuite: com.liferay.portal.kernel.util.ThreadLocalDistributorTest
          [junit] Loading file:/opt/dev/projects/github/liferay-portal/portal-kernel/test-classes/unit/system-ext.properties
          [junit] Tests run: 3, Failures: 0, Errors: 2, Skipped: 0, Time elapsed: 0.329 sec
          [junit] Tests run: 3, Failures: 0, Errors: 2, Skipped: 0, Time elapsed: 0.329 sec
          [junit] 
          [junit] Testcase: testSerialization(com.liferay.portal.kernel.util.ThreadLocalDistributorTest):	Caused an ERROR
          [junit] _nonStatic
          [junit] java.lang.NoSuchFieldException: _nonStatic
          [junit] 	at java.lang.Class.getDeclaredField(Class.java:2070)
          [junit] 	at com.liferay.petra.reflect.ReflectionUtil.getDeclaredField(ReflectionUtil.java:51)
          [junit] 	at com.liferay.portal.kernel.util.ThreadLocalDistributor.afterPropertiesSet(ThreadLocalDistributor.java:51)
          [junit] 	at com.liferay.portal.kernel.util.ThreadLocalDistributorTest.testSerialization(ThreadLocalDistributorTest.java:158)
          [junit] 
          [junit] 
          [junit] Testcase: testAfterPropertiesSet(com.liferay.portal.kernel.util.ThreadLocalDistributorTest):	Caused an ERROR
          [junit] _nonStatic
          [junit] java.lang.NoSuchFieldException: _nonStatic
          [junit] 	at java.lang.Class.getDeclaredField(Class.java:2070)
          [junit] 	at com.liferay.petra.reflect.ReflectionUtil.getDeclaredField(ReflectionUtil.java:51)
          [junit] 	at com.liferay.portal.kernel.util.ThreadLocalDistributor.afterPropertiesSet(ThreadLocalDistributor.java:51)
          [junit] 	at com.liferay.portal.kernel.util.ThreadLocalDistributorTest.testAfterPropertiesSet(ThreadLocalDistributorTest.java:83)
          [junit] 
          [junit] 
          [junit] Test com.liferay.portal.kernel.util.ThreadLocalDistributorTest FAILED
      

        Attachments

          Issue Links

            Activity

              People

              • Assignee:
                shuyang.zhou Shuyang Zhou
                Reporter:
                nicholas.kwon Nicholas Kwon
                Participants of an Issue:
                Recent user:
                Brian Wulbern
                Engineering Assignee:
                Kyle Miho
              • Votes:
                0 Vote for this issue
                Watchers:
                0 Start watching this issue

                Dates

                • Created:
                  Updated:
                  Resolved:
                  Days since last comment:
                  10 weeks, 1 day ago

                  Packages

                  Version Package
                  Master