Uploaded image for project: 'PUBLIC - Liferay Portal Community Edition'
  1. PUBLIC - Liferay Portal Community Edition
  2. LPS-114296

blade-samples-jdk8: Could not resolve com.liferay:javax.servlet.jsp:2.3.3-b02.LIFERAY-PATCHED-1

    Details

    • Type: Regression Bug
    • Status: Verified
    • Resolution: Unresolved
    • Affects Version/s: 7.0.X, 7.1.X
    • Fix Version/s: None
    • Component/s: Dev Tools
    • Labels:
    • Fix Priority:
      3

      Description

      For blade-samples-jdk8 batch :

          [exec] Picked up JAVA_TOOL_OPTIONS: -Dfile.encoding=UTF-8
           [exec] Java HotSpot(TM) 64-Bit Server VM warning: ignoring option MaxPermSize=256m; support was removed in 8.0
           [exec] Downloading https://services.gradle.org/distributions/gradle-3.5-bin.zip
           [exec] ..................................................................................................................................................................................................................................................................................................................................................................................................................................................................................................................................................................................................................................................................................................................................................................................................................................................................................................................................................................................................................................................................................................................................................................................................................................................................................................................................................................................................................................................................................................................................................................................................................................................................................................................................................................................................................................................................................................................................................................................................................................................................................................................................................................................................................................................................................................................................................................................................................................................................................................................................................................................................................................................................................................................................................................................................................................................................................................................................................................................................................................................................................................................................................................................................................................................................................................................................................................................................................................................................................................................................................................................................................................................................................................................................................................................................................
           [exec] Unzipping /root/.gradle/wrapper/dists/gradle-3.5-bin/daoimhu7k5rlo48ntmxw2ok3e/gradle-3.5-bin.zip to /root/.gradle/wrapper/dists/gradle-3.5-bin/daoimhu7k5rlo48ntmxw2ok3e
           [exec] Set executable permissions for: /root/.gradle/wrapper/dists/gradle-3.5-bin/daoimhu7k5rlo48ntmxw2ok3e/gradle-3.5/bin/gradle
           [exec] Starting a Gradle Daemon (subsequent builds will be faster)
           [exec] Download https://cdn.lfrs.sl/repository.liferay.com/nexus/content/groups/public/com/liferay/com.liferay.gradle.plugins.workspace/2.4.4/com.liferay.gradle.plugins.workspace-2.4.4.pom
           [exec] Download https://cdn.lfrs.sl/repository.liferay.com/nexus/content/groups/public/com/liferay/com.liferay.gradle.plugins/7.0.6/com.liferay.gradle.plugins-7.0.6.pom
           [exec] Download https://cdn.lfrs.sl/repository.liferay.com/nexus/content/groups/public/com/bmuschko/gradle-docker-plugin/3.6.2/gradle-docker-plugin-3.6.2.pom
           [exec] Download https://cdn.lfrs.sl/repository.liferay.com/nexus/content/groups/public/com/google/code/gson/gson/2.8.6/gson-2.8.6.pom
           [exec] Download https://cdn.lfrs.sl/repository.liferay.com/nexus/content/groups/public/com/google/code/gson/gson-parent/2.8.6/gson-parent-2.8.6.pom
           [exec] Download https://cdn.lfrs.sl/repository.liferay.com/nexus/content/groups/public/com/liferay/com.liferay.ant.bnd/3.2.5/com.liferay.ant.bnd-3.2.5.pom
           [exec] Download https://cdn.lfrs.sl/repository.liferay.com/nexus/content/groups/public/com/liferay/com.liferay.gradle.plugins.poshi.runner/2.2.27/com.liferay.gradle.plugins.poshi.runner-2.2.27.pom
           [exec] Download https://cdn.lfrs.sl/repository.liferay.com/nexus/content/groups/public/com/liferay/com.liferay.gradle.plugins.target.platform/2.1.11/com.liferay.gradle.plugins.target.platform-2.1.11.pom
           [exec] Download https://cdn.lfrs.sl/repository.liferay.com/nexus/content/groups/public/com/liferay/com.liferay.gradle.plugins.theme.builder/2.0.13/com.liferay.gradle.plugins.theme.builder-2.0.13.pom
           [exec] Download https://cdn.lfrs.sl/repository.liferay.com/nexus/content/groups/public/com/liferay/com.liferay.portal.tools.bundle.support/3.5.5/com.liferay.portal.tools.bundle.support-3.5.5.pom
           [exec] Download https://cdn.lfrs.sl/repository.liferay.com/nexus/content/groups/public/biz/aQute/bnd/biz.aQute.bnd/4.3.0/biz.aQute.bnd-4.3.0.pom
           [exec] Download https://cdn.lfrs.sl/repository.liferay.com/nexus/content/groups/public/com/liferay/com.liferay.gradle.util/1.0.39/com.liferay.gradle.util-1.0.39.pom
           [exec] Download https://cdn.lfrs.sl/repository.liferay.com/nexus/content/groups/public/biz/aQute/bnd/biz.aQute.bnd.gradle/4.3.0/biz.aQute.bnd.gradle-4.3.0.pom
           [exec] Download https://cdn.lfrs.sl/repository.liferay.com/nexus/content/groups/public/biz/aQute/bnd/biz.aQute.repository/4.3.0/biz.aQute.repository-4.3.0.pom
           [exec] Download https://cdn.lfrs.sl/repository.liferay.com/nexus/content/groups/public/biz/aQute/bnd/biz.aQute.resolve/4.3.0/biz.aQute.resolve-4.3.0.pom
           [exec] Download https://cdn.lfrs.sl/repository.liferay.com/nexus/content/groups/public/org/json/json/20180813/json-20180813.pom
           [exec] Download https://cdn.lfrs.sl/repository.liferay.com/nexus/content/groups/public/com/liferay/com.liferay.gradle.plugins.css.builder/3.1.3/com.liferay.gradle.plugins.css.builder-3.1.3.pom
           [exec] Download https://cdn.lfrs.sl/repository.liferay.com/nexus/content/groups/public/biz/aQute/bnd/biz.aQute.bndlib/4.3.0/biz.aQute.bndlib-4.3.0.pom
           [exec] Download https://cdn.lfrs.sl/repository.liferay.com/nexus/content/groups/public/biz/aQute/bnd/biz.aQute.bnd.embedded-repo/4.3.0/biz.aQute.bnd.embedded-repo-4.3.0.pom
           [exec] Download https://cdn.lfrs.sl/repository.liferay.com/nexus/content/groups/public/org/slf4j/slf4j-api/1.7.25/slf4j-api-1.7.25.pom
           [exec] Download https://cdn.lfrs.sl/repository.liferay.com/nexus/content/groups/public/org/slf4j/slf4j-parent/1.7.25/slf4j-parent-1.7.25.pom
           [exec] Download https://cdn.lfrs.sl/repository.liferay.com/nexus/content/groups/public/com/liferay/com.liferay.css.builder/3.0.2/com.liferay.css.builder-3.0.2.pom
           [exec] Download https://cdn.lfrs.sl/repository.liferay.com/nexus/content/groups/public/com/liferay/com.liferay.sass.compiler.jni/2.0.9/com.liferay.sass.compiler.jni-2.0.9.pom
           [exec] Download https://cdn.lfrs.sl/repository.liferay.com/nexus/content/groups/public/com/liferay/com.liferay.sass.compiler.ruby/2.0.6/com.liferay.sass.compiler.ruby-2.0.6.pom
           [exec] Download https://cdn.lfrs.sl/repository.liferay.com/nexus/content/groups/public/org/codehaus/plexus/plexus-utils/3.0.15/plexus-utils-3.0.15.pom
           [exec] Download https://cdn.lfrs.sl/repository.liferay.com/nexus/content/groups/public/org/codehaus/plexus/plexus/3.3.1/plexus-3.3.1.pom
           [exec] Download https://cdn.lfrs.sl/repository.liferay.com/nexus/content/groups/public/org/sonatype/spice/spice-parent/17/spice-parent-17.pom
           [exec] Download https://cdn.lfrs.sl/repository.liferay.com/nexus/content/groups/public/org/sonatype/forge/forge-parent/10/forge-parent-10.pom
           [exec] Download https://cdn.lfrs.sl/repository.liferay.com/nexus/content/groups/public/org/sonatype/plexus/plexus-build-api/0.0.7/plexus-build-api-0.0.7.pom
           [exec] Download https://cdn.lfrs.sl/repository.liferay.com/nexus/content/groups/public/org/sonatype/spice/spice-parent/15/spice-parent-15.pom
           [exec] Download https://cdn.lfrs.sl/repository.liferay.com/nexus/content/groups/public/org/sonatype/forge/forge-parent/5/forge-parent-5.pom
           [exec] Download https://cdn.lfrs.sl/repository.liferay.com/nexus/content/groups/public/com/liferay/com.liferay.sass.compiler.api/2.0.1/com.liferay.sass.compiler.api-2.0.1.pom
           [exec] Download https://cdn.lfrs.sl/repository.liferay.com/nexus/content/groups/public/org/jruby/jruby-complete/9.2.7.0/jruby-complete-9.2.7.0.pom
           [exec] Download https://cdn.lfrs.sl/repository.liferay.com/nexus/content/groups/public/org/jruby/jruby-artifacts/9.2.7.0/jruby-artifacts-9.2.7.0.pom
           [exec] Download https://cdn.lfrs.sl/repository.liferay.com/nexus/content/groups/public/org/jruby/jruby-parent/9.2.7.0/jruby-parent-9.2.7.0.pom
           [exec] Download https://cdn.lfrs.sl/repository.liferay.com/nexus/content/groups/public/com/liferay/com.liferay.gogo.shell.client/1.0.0/com.liferay.gogo.shell.client-1.0.0.pom
           [exec] Download https://cdn.lfrs.sl/repository.liferay.com/nexus/content/groups/public/com/liferay/com.liferay.gradle.plugins.alloy.taglib/2.0.4/com.liferay.gradle.plugins.alloy.taglib-2.0.4.pom
           [exec] Download https://cdn.lfrs.sl/repository.liferay.com/nexus/content/groups/public/com/liferay/com.liferay.gradle.plugins.db.support/1.0.7/com.liferay.gradle.plugins.db.support-1.0.7.pom
           [exec] Download https://cdn.lfrs.sl/repository.liferay.com/nexus/content/groups/public/com/liferay/com.liferay.gradle.plugins.gulp/2.0.75/com.liferay.gradle.plugins.gulp-2.0.75.pom
           [exec] Download https://cdn.lfrs.sl/repository.liferay.com/nexus/content/groups/public/com/liferay/com.liferay.gradle.plugins.jasper.jspc/2.0.9/com.liferay.gradle.plugins.jasper.jspc-2.0.9.pom
           [exec] Download https://cdn.lfrs.sl/repository.liferay.com/nexus/content/groups/public/com/liferay/com.liferay.gradle.plugins.javadoc.formatter/1.0.31/com.liferay.gradle.plugins.javadoc.formatter-1.0.31.pom
           [exec] Download https://cdn.lfrs.sl/repository.liferay.com/nexus/content/groups/public/com/liferay/com.liferay.gradle.plugins.js.module.config.generator/2.1.74/com.liferay.gradle.plugins.js.module.config.generator-2.1.74.pom
           [exec] Download https://cdn.lfrs.sl/repository.liferay.com/nexus/content/groups/public/com/liferay/com.liferay.gradle.plugins.js.transpiler/2.4.53/com.liferay.gradle.plugins.js.transpiler-2.4.53.pom
           [exec] Download https://cdn.lfrs.sl/repository.liferay.com/nexus/content/groups/public/com/liferay/com.liferay.gradle.plugins.lang.builder/3.0.16/com.liferay.gradle.plugins.lang.builder-3.0.16.pom
           [exec] Download https://cdn.lfrs.sl/repository.liferay.com/nexus/content/groups/public/com/liferay/com.liferay.gradle.plugins.rest.builder/1.0.102/com.liferay.gradle.plugins.rest.builder-1.0.102.pom
           [exec] Download https://cdn.lfrs.sl/repository.liferay.com/nexus/content/groups/public/com/liferay/com.liferay.gradle.plugins.service.builder/4.0.14/com.liferay.gradle.plugins.service.builder-4.0.14.pom
           [exec] Download https://cdn.lfrs.sl/repository.liferay.com/nexus/content/groups/public/com/liferay/com.liferay.gradle.plugins.source.formatter/3.0.30/com.liferay.gradle.plugins.source.formatter-3.0.30.pom
           [exec] Download https://cdn.lfrs.sl/repository.liferay.com/nexus/content/groups/public/com/liferay/com.liferay.gradle.plugins.soy/3.1.9/com.liferay.gradle.plugins.soy-3.1.9.pom
           [exec] Download https://cdn.lfrs.sl/repository.liferay.com/nexus/content/groups/public/com/liferay/com.liferay.gradle.plugins.test.integration/3.0.2/com.liferay.gradle.plugins.test.integration-3.0.2.pom
           [exec] Download https://cdn.lfrs.sl/repository.liferay.com/nexus/content/groups/public/com/liferay/com.liferay.gradle.plugins.tld.formatter/1.0.10/com.liferay.gradle.plugins.tld.formatter-1.0.10.pom
           [exec] Download https://cdn.lfrs.sl/repository.liferay.com/nexus/content/groups/public/com/liferay/com.liferay.gradle.plugins.tlddoc.builder/1.3.4/com.liferay.gradle.plugins.tlddoc.builder-1.3.4.pom
           [exec] Download https://cdn.lfrs.sl/repository.liferay.com/nexus/content/groups/public/com/liferay/com.liferay.gradle.plugins.upgrade.table.builder/3.0.1/com.liferay.gradle.plugins.upgrade.table.builder-3.0.1.pom
           [exec] Download https://cdn.lfrs.sl/repository.liferay.com/nexus/content/groups/public/com/liferay/com.liferay.gradle.plugins.wsdd.builder/1.0.15/com.liferay.gradle.plugins.wsdd.builder-1.0.15.pom
           [exec] Download https://cdn.lfrs.sl/repository.liferay.com/nexus/content/groups/public/com/liferay/com.liferay.gradle.plugins.wsdl.builder/3.0.1/com.liferay.gradle.plugins.wsdl.builder-3.0.1.pom
           [exec] Download https://cdn.lfrs.sl/repository.liferay.com/nexus/content/groups/public/com/liferay/com.liferay.gradle.plugins.xsd.builder/1.0.9/com.liferay.gradle.plugins.xsd.builder-1.0.9.pom
           [exec] Download https://cdn.lfrs.sl/repository.liferay.com/nexus/content/groups/public/com/liferay/com.liferay.gradle.plugins.node/7.0.5/com.liferay.gradle.plugins.node-7.0.5.pom
           [exec] Download https://cdn.lfrs.sl/repository.liferay.com/nexus/content/groups/public/com/liferay/com.liferay.portal.servlet.jsp.compiler/1.0.5/com.liferay.portal.servlet.jsp.compiler-1.0.5.pom
           [exec] Download https://cdn.lfrs.sl/repository.liferay.com/nexus/content/groups/public/com/liferay/com.liferay.portal.tools.soy.builder/3.0.4/com.liferay.portal.tools.soy.builder-3.0.4.pom
           [exec] Download https://cdn.lfrs.sl/repository.liferay.com/nexus/content/groups/public/org/zeroturnaround/zt-exec/1.9/zt-exec-1.9.pom
           [exec] Download https://cdn.lfrs.sl/repository.liferay.com/nexus/content/groups/public/com/liferay/com.liferay.osgi.util/2.0.5/com.liferay.osgi.util-2.0.5.pom
           [exec] Download https://cdn.lfrs.sl/repository.liferay.com/nexus/content/groups/public/org/glassfish/javax.el/3.0.1-b05/javax.el-3.0.1-b05.pom
           [exec] Download https://cdn.lfrs.sl/repository.liferay.com/nexus/content/groups/public/net/java/jvnet-parent/3/jvnet-parent-3.pom
           [exec] Download https://cdn.lfrs.sl/repository.liferay.com/nexus/content/groups/public/org/glassfish/web/javax.servlet.jsp.jstl/1.2.3/javax.servlet.jsp.jstl-1.2.3.pom
           [exec] Download https://cdn.lfrs.sl/repository.liferay.com/nexus/content/groups/public/org/osgi/org.osgi.compendium/5.0.0/org.osgi.compendium-5.0.0.pom
           [exec] Download https://cdn.lfrs.sl/repository.liferay.com/nexus/content/groups/public/org/glassfish/javax.servlet/3.2-b06/javax.servlet-3.2-b06.pom
           [exec] Download https://cdn.lfrs.sl/repository.liferay.com/nexus/content/groups/public/org/glassfish/api-pom/3.2-b06/api-pom-3.2-b06.pom
           [exec] Download https://cdn.lfrs.sl/repository.liferay.com/nexus/content/groups/public/org/glassfish/glassfish-parent/3.2-b06/glassfish-parent-3.2-b06.pom
           [exec] Download https://cdn.lfrs.sl/repository.liferay.com/nexus/content/groups/public/org/glassfish/pom/8/pom-8.pom
           [exec] Download https://cdn.lfrs.sl/repository.liferay.com/nexus/content/groups/public/commons-io/commons-io/1.4/commons-io-1.4.pom
           [exec] Download https://cdn.lfrs.sl/repository.liferay.com/nexus/content/groups/public/org/apache/commons/commons-parent/7/commons-parent-7.pom
           [exec] Download https://cdn.lfrs.sl/repository.liferay.com/nexus/content/groups/public/org/osgi/org.osgi.core/5.0.0/org.osgi.core-5.0.0.pom
           [exec] Download https://cdn.lfrs.sl/repository.liferay.com/nexus/content/groups/public/javax/servlet/jsp/jstl/jstl-api/1.2/jstl-api-1.2.pom
           [exec] Download https://cdn.lfrs.sl/repository.liferay.com/nexus/content/groups/public/org/glassfish/web/jstl/1.2/jstl-1.2.pom
           [exec] Download https://cdn.lfrs.sl/repository.liferay.com/nexus/content/groups/public/net/java/jvnet-parent/1/jvnet-parent-1.pom
           [exec] Download https://cdn.lfrs.sl/repository.liferay.com/nexus/content/groups/public/com/liferay/com.liferay.gradle.util/1.0.42/com.liferay.gradle.util-1.0.42.pom
           [exec] 
           [exec] BUILD FAILED
           [exec] 
           [exec] Total time: 35.337 secs
           [exec] 
           [exec] FAILURE: Build failed with an exception.
           [exec] 
           [exec] * What went wrong:
           [exec] Could not resolve all dependencies for configuration 'classpath'.
           [exec] > Could not resolve com.liferay:javax.servlet.jsp:2.3.3-b02.LIFERAY-PATCHED-1.
           [exec]   Required by:
           [exec]       unspecified:unspecified:unspecified > com.liferay:com.liferay.gradle.plugins:7.0.6 > com.liferay:com.liferay.gradle.plugins.jasper.jspc:2.0.9 > com.liferay:com.liferay.portal.servlet.jsp.compiler:1.0.5
           [exec]    > Could not resolve com.liferay:javax.servlet.jsp:2.3.3-b02.LIFERAY-PATCHED-1.
           [exec]       > Could not get resource 'https://cdn.lfrs.sl/repository.liferay.com/nexus/content/groups/public/com/liferay/javax.servlet.jsp/2.3.3-b02.LIFERAY-PATCHED-1/javax.servlet.jsp-2.3.3-b02.LIFERAY-PATCHED-1.pom'.
           [exec]          > Could not GET 'https://cdn.lfrs.sl/repository.liferay.com/nexus/content/groups/public/com/liferay/javax.servlet.jsp/2.3.3-b02.LIFERAY-PATCHED-1/javax.servlet.jsp-2.3.3-b02.LIFERAY-PATCHED-1.pom'. Received status code 502 from server: Proxy Error
           [exec] 
           [exec] * Try:
           [exec] Run with --stacktrace option to get the stack trace. Run with --info or --debug option to get more log output.
      [stopwatch] [run.batch.test.action: 35.766 sec]
           [echo] The following error occurred while executing this line:
           [echo] /opt/dev/projects/github/liferay-portal-7.0.x/build-common.xml:583: The following error occurred while executing this line:
           [echo] /opt/dev/projects/github/liferay-portal-7.0.x/build-common.xml:702: exec returned: 1
            [get] Getting: http://test-1-16/job/test-portal-acceptance-pullrequest-batch(7.0.x)/AXIS_VARIABLE=0,label_exp=!master/35181//consoleText
            [get] To: /opt/dev/projects/github/liferay-portal-7.0.x/20200524230422032.txt
         [delete] Deleting: /opt/dev/projects/github/liferay-portal-7.0.x/20200524230422032.txt
         [delete] Deleting: /opt/dev/projects/github/liferay-portal-7.0.x/null647165483.properties
      
      merge-test-results:
          [mkdir] Created dir: /opt/dev/projects/github/liferay-portal-7.0.x/test-results
      [junitreport] Processing /opt/dev/projects/github/liferay-portal-7.0.x/test-results/TESTS-TestSuites.xml to /tmp/null1273201915
      [junitreport] Loading stylesheet jar:file:/opt/java/ant/lib/ant-junit.jar!/org/apache/tools/ant/taskdefs/optional/junit/xsl/junit-frames.xsl
      [junitreport] Transform time: 161ms
      [junitreport] Deleting: /tmp/null1273201915
           [echo] A report with all the test results can be found at test-results/html/index.html.
          [mkdir] Created dir: /opt/dev/projects/github/liferay-jenkins-ee/test-results
           [copy] Copying 1 file to /opt/dev/projects/github/liferay-jenkins-ee/test-results
           [echo] run.batch.test.tear.down.start.timestamp: 05-24-2020 23:04:25:257 PDT
      [stopwatch] [run.batch.test.tear.down: 0.000 sec]
           [echo] 
           [echo] Ant GC log:
           [echo] 
           [echo] Java HotSpot(TM) 64-Bit Server VM (25.121-b13) for linux-amd64 JRE (1.8.0_121-b13), built on Dec 12 2016 16:36:53 by "java_re" with gcc 4.3.0 20080428 (Red Hat 4.3.0-8)
           [echo] Memory: 4k page, physical 32902068k(5796736k free), swap 0k(0k free)
           [echo] CommandLine flags: -XX:-BytecodeVerificationLocal -XX:-BytecodeVerificationRemote -XX:+DisableExplicitGC -XX:+HeapDumpOnOutOfMemoryError -XX:HeapDumpPath=/tmp/ant-oom-heap-dump.bin -XX:InitialHeapSize=1073741824 -XX:InitialTenuringThreshold=0 -XX:MaxHeapSize=3221225472 -XX:MaxMetaspaceSize=536870912 -XX:MaxNewSize=536870912 -XX:MaxTenuringThreshold=0 -XX:MetaspaceSize=104857600 -XX:NewSize=268435456 -XX:+PrintGC -XX:+PrintGCCause -XX:+PrintGCDetails -XX:+PrintGCTimeStamps -XX:SurvivorRatio=65536 -XX:TargetSurvivorRatio=0 -XX:ThreadStackSize=2048 -XX:+UseCompressedClassPointers -XX:+UseCompressedOops -XX:+UseParallelOldGC 
           [echo] 1.169: [GC (Allocation Failure) [PSYoungGen: 261120K->0K(261632K)] 261120K->19812K(1048064K), 0.0107961 secs] [Times: user=0.06 sys=0.02, real=0.01 secs] 
           [echo] 2.854: [GC (Allocation Failure) [PSYoungGen: 261120K->0K(261632K)] 280932K->42870K(1048064K), 0.0115075 secs] [Times: user=0.06 sys=0.01, real=0.01 secs] 
           [echo] 5.222: [GC (Allocation Failure) [PSYoungGen: 261120K->0K(261632K)] 303990K->48911K(1048064K), 0.0044247 secs] [Times: user=0.02 sys=0.01, real=0.01 secs] 
           [echo] 6.467: [GC (Allocation Failure) [PSYoungGen: 261120K->0K(261632K)] 310031K->52916K(1048064K), 0.0021958 secs] [Times: user=0.00 sys=0.01, real=0.00 secs] 
           [echo] 7.709: [GC (Allocation Failure) [PSYoungGen: 261120K->0K(261632K)] 314036K->62655K(1048064K), 0.0083451 secs] [Times: user=0.05 sys=0.01, real=0.01 secs] 
           [echo] 9.392: [GC (Allocation Failure) [PSYoungGen: 261120K->0K(261632K)] 323775K->75311K(1048064K), 0.0088723 secs] [Times: user=0.05 sys=0.01, real=0.01 secs] 
           [echo] 13.829: [GC (Allocation Failure) [PSYoungGen: 261120K->0K(261632K)] 336431K->82590K(1048064K), 0.0050461 secs] [Times: user=0.04 sys=0.00, real=0.01 secs] 
           [echo] 17.326: [GC (Allocation Failure) [PSYoungGen: 261120K->0K(261632K)] 343710K->94705K(1048064K), 0.0078249 secs] [Times: user=0.05 sys=0.01, real=0.01 secs] 
           [echo] 38.600: [GC (Allocation Failure) [PSYoungGen: 261120K->0K(261632K)] 355825K->99795K(1048064K), 0.0050977 secs] [Times: user=0.03 sys=0.00, real=0.01 secs] 
           [echo] 48.927: [GC (Allocation Failure) [PSYoungGen: 261071K->0K(261632K)] 360866K->126787K(1048064K), 0.0141573 secs] [Times: user=0.09 sys=0.01, real=0.01 secs] 
           [echo] 63.120: [GC (Allocation Failure) [PSYoungGen: 261120K->0K(261632K)] 387907K->168901K(1048064K), 0.0216570 secs] [Times: user=0.15 sys=0.02, real=0.02 secs] 
           [echo] 63.726: [GC (Allocation Failure) [PSYoungGen: 261120K->0K(261632K)] 430021K->283548K(1048064K), 0.0413670 secs] [Times: user=0.27 sys=0.03, real=0.04 secs] 
           [echo] 64.303: [GC (Allocation Failure) [PSYoungGen: 261120K->0K(261632K)] 544668K->360557K(1048064K), 0.0318813 secs] [Times: user=0.20 sys=0.02, real=0.04 secs] 
           [echo] 64.471: [GC (Allocation Failure) [PSYoungGen: 261120K->0K(418304K)] 621677K->368721K(1204736K), 0.0052808 secs] [Times: user=0.01 sys=0.00, real=0.01 secs] 
           [echo] 65.157: [GC (Allocation Failure) [PSYoungGen: 417792K->0K(418304K)] 786513K->471926K(1204736K), 0.0311131 secs] [Times: user=0.20 sys=0.03, real=0.03 secs] 
           [echo] 65.963: [GC (Allocation Failure) [PSYoungGen: 417792K->0K(523776K)] 889718K->592392K(1310208K), 0.0411329 secs] [Times: user=0.28 sys=0.03, real=0.05 secs] 
           [echo] 80.197: [GC (Allocation Failure) [PSYoungGen: 523264K->0K(523776K)] 1115656K->632866K(1310208K), 0.0156616 secs] [Times: user=0.08 sys=0.00, real=0.02 secs] 
           [echo] 81.065: [GC (Allocation Failure) [PSYoungGen: 523264K->0K(523776K)] 1156130K->750159K(1310208K), 0.0538875 secs] [Times: user=0.34 sys=0.06, real=0.05 secs] 
           [echo] 81.119: [Full GC (Ergonomics) [PSYoungGen: 0K->0K(523776K)] [ParOldGen: 750159K->277143K(786432K)] 750159K->277143K(1310208K), [Metaspace: 56145K->55830K(1099776K)], 0.3135456 secs] [Times: user=1.74 sys=0.03, real=0.32 secs] 
           [echo] 81.691: [GC (Allocation Failure) [PSYoungGen: 523264K->0K(523776K)] 800407K->292431K(1310208K), 0.0127269 secs] [Times: user=0.09 sys=0.00, real=0.02 secs] 
           [echo] 82.442: [GC (Allocation Failure) [PSYoungGen: 523264K->0K(523776K)] 815695K->406093K(1310208K), 0.0384803 secs] [Times: user=0.29 sys=0.00, real=0.04 secs] 
           [echo] 82.704: [GC (Allocation Failure) [PSYoungGen: 523264K->0K(523776K)] 929357K->446310K(1310208K), 0.0205058 secs] [Times: user=0.14 sys=0.00, real=0.02 secs] 
           [echo] 96.644: [GC (Allocation Failure) [PSYoungGen: 523264K->0K(523776K)] 969574K->464557K(1310208K), 0.0116861 secs] [Times: user=0.07 sys=0.00, real=0.02 secs] 
           [echo] 97.376: [GC (Allocation Failure) [PSYoungGen: 523264K->0K(523776K)] 987821K->546468K(1310208K), 0.0318901 secs] [Times: user=0.21 sys=0.00, real=0.03 secs] 
           [echo] K(296960K)] 738053K->460197K(1083392K), 0.0120432 secs] [Times: user=0.08 sys=0.01, real=0.01 secs] 
           [echo] 121.710: [GC (Allocation Failure) [PSYoungGen: 296448K->0K(289280K)] 756645K->493652K(1075712K), 0.0110404 secs] [Times: user=0.07 sys=0.01, real=0.01 secs] 
           [echo] 122.346: [GC (Allocation Failure) [PSYoungGen: 288768K->0K(282112K)] 782420K->498464K(1068544K), 0.0060023 secs] [Times: user=0.04 sys=0.00, real=0.00 secs] 
           [echo] 122.876: [GC (Allocation Failure) [PSYoungGen: 281600K->0K(274944K)] 780064K->501034K(1061376K), 0.0045795 secs] [Times: user=0.03 sys=0.00, real=0.00 secs] 
           [echo] 123.341: [GC (Allocation Failure) [PSYoungGen: 274432K->0K(268288K)] 775466K->502627K(1054720K), 0.0033152 secs] [Times: user=0.03 sys=0.00, real=0.01 secs] 
           [echo] 123.761: [GC (Allocation Failure) [PSYoungGen: 267776K->0K(522752K)] 770403K->504347K(1309184K), 0.0034778 secs] [Times: user=0.01 sys=0.01, real=0.01 secs] 
           [echo] 126.289: [GC (Allocation Failure) [PSYoungGen: 522240K->0K(505856K)] 1026587K->535854K(1292288K), 0.0126915 secs] [Times: user=0.08 sys=0.02, real=0.01 secs] 
           [echo] 135.863: [GC (Allocation Failure) [PSYoungGen: 505344K->0K(489472K)] 1041198K->551936K(1275904K), 0.0072188 secs] [Times: user=0.03 sys=0.01, real=0.00 secs] 
           [echo] 141.074: [GC (Allocation Failure) [PSYoungGen: 488960K->0K(473600K)] 1040896K->592270K(1260032K), 0.0206241 secs] [Times: user=0.14 sys=0.01, real=0.03 secs] 
           [echo] 144.739: [GC (Allocation Failure) [PSYoungGen: 473088K->0K(458752K)] 1065358K->619947K(1245184K), 0.0137628 secs] [Times: user=0.09 sys=0.02, real=0.01 secs] 
           [echo] 150.530: [GC (Allocation Failure) [PSYoungGen: 458240K->0K(444416K)] 1078187K->645701K(1230848K), 0.0110081 secs] [Times: user=0.08 sys=0.00, real=0.01 secs] 
           [echo] 155.569: [GC (Allocation Failure) [PSYoungGen: 443904K->0K(430592K)] 1089605K->667493K(1217024K), 0.0101569 secs] [Times: user=0.06 sys=0.01, real=0.01 secs] 
           [echo] 156.745: [GC (Allocation Failure) [PSYoungGen: 430080K->0K(417280K)] 1097573K->708409K(1203712K), 0.0181215 secs] [Times: user=0.12 sys=0.02, real=0.02 secs] 
           [echo] 273.571: [GC (Allocation Failure) [PSYoungGen: 416768K->0K(404480K)] 1125177K->745365K(1190912K), 0.0170770 secs] [Times: user=0.10 sys=0.02, real=0.02 secs] 
           [echo] 273.588: [Full GC (Ergonomics) [PSYoungGen: 0K->0K(404480K)] [ParOldGen: 745365K->295436K(786432K)] 745365K->295436K(1190912K), [Metaspace: 70485K->49249K(1116160K)], 0.5059388 secs] [Times: user=1.97 sys=0.02, real=0.50 secs] 
           [echo] 275.538: [GC (Allocation Failure) [PSYoungGen: 403968K->0K(392192K)] 699404K->343548K(1178624K), 0.0169349 secs] [Times: user=0.13 sys=0.00, real=0.02 secs] 
           [echo] 
           [echo] 					
           [echo] The following error occurred while executing this line:
           [echo] /opt/dev/projects/github/liferay-portal-7.0.x/build-test-batch.xml:3000: The following error occurred while executing this line:
           [echo] /opt/dev/projects/github/liferay-portal-7.0.x/build-test-batch.xml:1143: /opt/dev/projects/github/liferay-portal-7.0.x/build-test-batch.xml:3002: The following error occurred while executing this line:
           [echo] /opt/dev/projects/github/liferay-portal-7.0.x/build-common.xml:583: The following error occurred while executing this line:
           [echo] /opt/dev/projects/github/liferay-portal-7.0.x/build-common.xml:702: exec returned: 1
           [echo] record.testray.results.start.timestamp: 05-24-2020 23:04:25:331 PDT
      
      record-testray-logs:
           [echo] record.testray.logs.start.timestamp: 05-24-2020 23:04:25:395 PDT
      [stopwatch] [record.testray.logs: 0.018 sec]
      
      record-testray-results:
           [echo] record.testray.results.TESTS-test-1-3_test-portal-acceptance-pullrequest(7.0.x)_793_blade-samples-jdk8_0_functional.xml.start.timestamp: 05-24-2020 23:04:25:475 PDT
           [copy] Copying 1 file to /opt/dev/projects/github/liferay-jenkins-ee/testray/dependencies
           [copy] Copying /opt/dev/projects/github/liferay-portal-7.0.x/test.cloud-10-0-13-190.lax.liferay.com.properties to /opt/dev/projects/github/liferay-jenkins-ee/testray/dependencies/test.cloud-10-0-13-190.lax.liferay.com.properties
           [copy] Warning: Could not find file /opt/dev/projects/github/liferay-portal-7.0.x/test.generated.properties to copy.
           [copy] Copying 1 file to /opt/dev/projects/github/liferay-jenkins-ee/testray/dependencies
           [copy] Copying /opt/dev/projects/github/liferay-portal-7.0.x/test.properties to /opt/dev/projects/github/liferay-jenkins-ee/testray/dependencies/test.properties
           [copy] Copying 1 file to /opt/dev/projects/github/liferay-jenkins-ee/testray/dependencies
           [copy] Copying /opt/dev/projects/github/liferay-portal-7.0.x/app.server.properties to /opt/dev/projects/github/liferay-jenkins-ee/testray/dependencies/app.server.properties
           [copy] Copying 1 file to /opt/dev/projects/github/liferay-jenkins-ee/testray/dependencies
           [copy] Copying /opt/dev/projects/github/liferay-portal-7.0.x/test.case.method.names.properties to /opt/dev/projects/github/liferay-jenkins-ee/testray/dependencies/test.case.method.names.properties
           [copy] Warning: Could not find file /opt/dev/projects/github/liferay-portal-7.0.x/poshi-warnings.xml to copy.
          [mkdir] Created dir: /opt/dev/projects/github/liferay-jenkins-ee/testray/logs/test-1-3/1590379637219/test-portal-acceptance-pullrequest(7.0.x)/793/blade-samples-jdk8/0
      [beanshell] null
      [beanshell] 
           [exec] Listing files that will be compressed.
           [exec] /opt/dev/projects/github/liferay-jenkins-ee/testray/logs
           [exec] | | | | | | |____logs
           [exec] | | | | | | | |____test-1-3
           [exec] | | | | | | | | |____1590379637219
           [exec] | | | | | | | | | |____test-portal-acceptance-pullrequest(7.0.x)
           [exec] | | | | | | | | | | |____793
           [exec] | | | | | | | | | | | |____blade-samples-jdk8
           [exec] | | | | | | | | | | | | |____0
           [exec] | | | | | | | | | | | | | |____jenkins-console.txt
           [exec] Executing gzip.
           [exec] Listing files that were compressed.
           [exec] | | | | | | |____logs
           [exec] | | | | | | | |____test-1-3
           [exec] | | | | | | | | |____1590379637219
           [exec] | | | | | | | | | |____test-portal-acceptance-pullrequest(7.0.x)
           [exec] | | | | | | | | | | |____793
           [exec] | | | | | | | | | | | |____blade-samples-jdk8
           [exec] | | | | | | | | | | | | |____0
           [exec] | | | | | | | | | | | | | |____jenkins-console.txt.gz
         [delete] Deleting: /opt/dev/projects/github/liferay-jenkins-ee/commands/20200524230425607
      [replaceregexp] The following file is missing: '/opt/dev/projects/github/liferay-jenkins-ee/testray/dependencies/test.generated.properties'
           [echo] Build testray result: /opt/dev/projects/github/liferay-jenkins-ee/testray/suite/TESTS-test-1-3_test-portal-acceptance-pullrequest(7.0.x)_793_blade-samples-jdk8_0_functional.xml
           [echo] send.to.testray.logs.start.timestamp: 05-24-2020 23:04:25:662 PDT
           [echo] Sending Testray logs to Testray production server.
         [delete] Deleting: /opt/dev/projects/github/liferay-jenkins-ee/commands/20200524230425664
      [stopwatch] [send.to.testray.logs: 0.324 sec]
           [echo] send.to.testray.results.start.timestamp: 05-24-2020 23:04:25:988 PDT
           [echo] Sending Testray results to Testray production server.
         [delete] Deleting: /opt/dev/projects/github/liferay-jenkins-ee/commands/20200524230425989
      [stopwatch] [send.to.testray.results: 0.221 sec]
      [stopwatch] [record.testray.results.TESTS-test-1-3_test-portal-acceptance-pullrequest(7.0.x)_793_blade-samples-jdk8_0_functional.xml: 0.734 sec]
      
      clear-testray-results:
         [delete] Deleting directory /opt/dev/projects/github/liferay-jenkins-ee/testray
      
      record-testray-results:
           [echo] record.testray.results.TESTS-test-1-3_test-portal-acceptance-pullrequest(7.0.x)_793_blade-samples-jdk8_0_modules_integration.xml.start.timestamp: 05-24-2020 23:04:26:333 PDT
           [copy] Copying 1 file to /opt/dev/projects/github/liferay-jenkins-ee/testray/dependencies
           [copy] Copying /opt/dev/projects/github/liferay-portal-7.0.x/test.cloud-10-0-13-190.lax.liferay.com.properties to /opt/dev/projects/github/liferay-jenkins-ee/testray/dependencies/test.cloud-10-0-13-190.lax.liferay.com.properties
           [copy] Warning: Could not find file /opt/dev/projects/github/liferay-portal-7.0.x/test.generated.properties to copy.
           [copy] Copying 1 file to /opt/dev/projects/github/liferay-jenkins-ee/testray/dependencies
           [copy] Copying /opt/dev/projects/github/liferay-portal-7.0.x/test.properties to /opt/dev/projects/github/liferay-jenkins-ee/testray/dependencies/test.properties
           [copy] Copying 1 file to /opt/dev/projects/github/liferay-jenkins-ee/testray/dependencies
           [copy] Copying /opt/dev/projects/github/liferay-portal-7.0.x/app.server.properties to /opt/dev/projects/github/liferay-jenkins-ee/testray/dependencies/app.server.properties
           [copy] Copying 1 file to /opt/dev/projects/github/liferay-jenkins-ee/testray/dependencies
           [copy] Copying /opt/dev/projects/github/liferay-portal-7.0.x/test.case.method.names.properties to /opt/dev/projects/github/liferay-jenkins-ee/testray/dependencies/test.case.method.names.properties
           [copy] Warning: Could not find file /opt/dev/projects/github/liferay-portal-7.0.x/poshi-warnings.xml to copy.
          [mkdir] Created dir: /opt/dev/projects/github/liferay-jenkins-ee/testray/logs/test-1-3/1590379637219/test-portal-acceptance-pullrequest(7.0.x)/793/blade-samples-jdk8/0
      [beanshell] null
      [beanshell] 
           [exec] Listing files that will be compressed.
           [exec] /opt/dev/projects/github/liferay-jenkins-ee/testray/logs
           [exec] | | | | | | |____logs
           [exec] | | | | | | | |____test-1-3
           [exec] | | | | | | | | |____1590379637219
           [exec] | | | | | | | | | |____test-portal-acceptance-pullrequest(7.0.x)
           [exec] | | | | | | | | | | |____793
           [exec] | | | | | | | | | | | |____blade-samples-jdk8
           [exec] | | | | | | | | | | | | |____0
           [exec] | | | | | | | | | | | | | |____jenkins-console.txt
           [exec] Executing gzip.
           [exec] Listing files that were compressed.
           [exec] | | | | | | |____logs
           [exec] | | | | | | | |____test-1-3
           [exec] | | | | | | | | |____1590379637219
           [exec] | | | | | | | | | |____test-portal-acceptance-pullrequest(7.0.x)
           [exec] | | | | | | | | | | |____793
           [exec] | | | | | | | | | | | |____blade-samples-jdk8
           [exec] | | | | | | | | | | | | |____0
           [exec] | | | | | | | | | | | | | |____jenkins-console.txt.gz
         [delete] Deleting: /opt/dev/projects/github/liferay-jenkins-ee/commands/20200524230426440
      [replaceregexp] The following file is missing: '/opt/dev/projects/github/liferay-jenkins-ee/testray/dependencies/test.generated.properties'
           [echo] Build testray result: /opt/dev/projects/github/liferay-jenkins-ee/testray/suite/TESTS-test-1-3_test-portal-acceptance-pullrequest(7.0.x)_793_blade-samples-jdk8_0_modules_integration.xml
           [echo] send.to.testray.logs.start.timestamp: 05-24-2020 23:04:26:490 PDT
           [echo] Sending Testray logs to Testray production server.
         [delete] Deleting: /opt/dev/projects/github/liferay-jenkins-ee/commands/20200524230426491
      [stopwatch] [send.to.testray.logs: 0.281 sec]
           [echo] send.to.testray.results.start.timestamp: 05-24-2020 23:04:26:771 PDT
           [echo] Sending Testray results to Testray production server.
         [delete] Deleting: /opt/dev/projects/github/liferay-jenkins-ee/commands/20200524230426773
      [stopwatch] [send.to.testray.results: 0.164 sec]
      [stopwatch] [record.testray.results.TESTS-test-1-3_test-portal-acceptance-pullrequest(7.0.x)_793_blade-samples-jdk8_0_modules_integration.xml: 0.602 sec]
      [stopwatch] [record.testray.results: 1.605 sec]
      
      BUILD FAILED
      /opt/dev/projects/github/liferay-jenkins-ee/commands/build-common.xml:11821: The following error occurred while executing this line:
      /opt/dev/projects/github/liferay-portal-7.0.x/build-test-batch.xml:3000: The following error occurred while executing this line:
      /opt/dev/projects/github/liferay-portal-7.0.x/build-test-batch.xml:1143: /opt/dev/projects/github/liferay-portal-7.0.x/build-test-batch.xml:3002: The following error occurred while executing this line:
      /opt/dev/projects/github/liferay-portal-7.0.x/build-common.xml:583: The following error occurred while executing this line:
      /opt/dev/projects/github/liferay-portal-7.0.x/build-common.xml:702: exec returned: 1
      
      Total time: 4 minutes 38 seconds
      Build step 'Execute shell' marked build as failure
      Recording test results
      [CucumberReport] Using Cucumber Reports version 4.5.0
      [CucumberReport] JSON report directory is "test-results/cucumber/build/reports/json"
      [CucumberReport] Copied 0 json files from workspace "/opt/dev/projects/github/liferay-jenkins-ee/test-results/cucumber/build/reports/json" to reports directory "/opt/java/jenkins/jobs/test-portal-acceptance-pullrequest-batch(7.0.x)/configurations/axis-AXIS_VARIABLE/0/axis-label_exp/!master/builds/35181/cucumber-html-reports/.cache"
      [CucumberReport] Copied 0 properties files from workspace "/opt/dev/projects/github/liferay-jenkins-ee/test-results/cucumber/build/reports/json" to reports directory "/opt/java/jenkins/jobs/test-portal-acceptance-pullrequest-batch(7.0.x)/configurations/axis-AXIS_VARIABLE/0/axis-label_exp/!master/builds/35181/cucumber-html-reports/.cache"
      [CucumberReport] Processing 0 json files:
      [CucumberReport] Missing report result - report was not successfully completed
      [CucumberReport] Build status is left unchanged
      [PostBuildScript] - Executing post build scripts.
      define: [LabelParameterValue: NODE_NAME=cloud-10-0-13-190]
      Triggering projects: verification-node
      [liferay-jenkins-ee] $ /bin/bash -e -x /tmp/jenkins6505978154747021508.sh
      + echo 'Update the workspace repository for post-build steps.'
      Update the workspace repository for post-build steps.
      + git clean -d -f -x
      Removing .ssh/
      Removing git/
      Removing reset.repository.log
      Removing start.properties
      Removing test-results/
      Removing testray/
      + git reset --hard
      HEAD is now at 1b356be3d4 LRCI-1340 Don't print standard error of git commands in console log
      + set +e
      + git show-ref --verify --quiet refs/heads/master-temp-1590386357845
      + VERIFY_BRANCH_RESULT=0
      + set -e
      + [[ 0 == 0 ]]
      + git checkout master-temp-1590386357845
      Already on 'master-temp-1590386357845'
      + git log -n 1
      commit 1b356be3d4f66b0e316c08cfa87d8f984a94b356
      Author: pyoo47 <peter.yoo@liferay.com>
      Date:   Fri May 22 16:43:59 2020 -0700
      
          LRCI-1340 Don't print standard error of git commands in console log
      + echo 'Exit shell.'
      Exit shell.
      [liferay-jenkins-ee] $ /bin/bash -e -x /tmp/jenkins8416436843365094692.sh
      + echo 'Execute: build-test-portal-acceptance-pullrequest-batch.sh stop-current-job'
      Execute: build-test-portal-acceptance-pullrequest-batch.sh stop-current-job
      + commands/build-test-portal-acceptance-pullrequest-batch.sh stop-current-job
      Execute: ant -f commands/build-common.xml run-ant-target -Dant.file.name=build-test-portal-acceptance-pullrequest-batch.xml -Dant.target=stop-current-job -lib commands/../lib/jenkins
      Picked up JAVA_TOOL_OPTIONS: -Dfile.encoding=UTF-8
      Buildfile: /opt/dev/projects/github/liferay-jenkins-ee/commands/build-common.xml
      [beanshell] Securing standard error and out
      
      run-ant-target:
      
      

        Attachments

          Activity

            People

            Assignee:
            support-lep@liferay.com SE Support
            Reporter:
            melody.wu Melody Wu
            Participants of an Issue:
            Recent user:
            Brian Wulbern
            Votes:
            0 Vote for this issue
            Watchers:
            0 Start watching this issue

              Dates

              Created:
              Updated:
              Days since last comment:
              21 weeks ago

                Packages

                Version Package