Uploaded image for project: 'PUBLIC - Liferay Portal Community Edition'
  1. PUBLIC - Liferay Portal Community Edition
  2. LPS-114299

':private:apps:osb-customer:osb-portlet:compile-jsp' failed on compile-jsp-jdk8

    Details

    • Type: Regression Bug
    • Status: Verified
    • Resolution: Unresolved
    • Affects Version/s: 7.0.X
    • Fix Version/s: None
    • Component/s: Dev Tools
    • Labels:
    • Fix Priority:
      3

      Description

      For compile-jsp-jdk8 batch :

       [exec] > Task :private:apps:osb-customer:osb-portlet:compile-jsp
           [exec] [ant:javac] Note: Some input files use or override a deprecated API.
           [exec] [ant:javac] Note: Recompile with -Xlint:deprecation for details.
           [exec] [ant:javac] Note: Some input files use unchecked or unsafe operations.
           [exec] [ant:javac] Note: Recompile with -Xlint:unchecked for details.
           [exec] [ant:echo] 
           [exec] /opt/dev/projects/github/liferay-portal-7.0.x/modules/private/apps/osb-customer/osb-portlet/20200524231843764/src/org/apache/jsp/admin/select_005faccount_005fworker_jsp.java:658: error: cannot find symbol
           [exec] 						searchContainer.setTotal(UserLocalServiceUtil.searchCount(themeDisplay.getCompanyId(), firstName, middleName, lastName, screenName, emailAddress, WorkflowConstants.STATUS_ANY, userParams, true));
           [exec] 						                                                                                       ^
           [exec]   symbol:   variable firstName
           [exec]   location: class select_005faccount_005fworker_jsp
           [exec] /opt/dev/projects/github/liferay-portal-7.0.x/modules/private/apps/osb-customer/osb-portlet/20200524231843764/src/org/apache/jsp/admin/select_005faccount_005fworker_jsp.java:658: error: cannot find symbol
           [exec] 						searchContainer.setTotal(UserLocalServiceUtil.searchCount(themeDisplay.getCompanyId(), firstName, middleName, lastName, screenName, emailAddress, WorkflowConstants.STATUS_ANY, userParams, true));
           [exec] 						                                                                                                  ^
           [exec]   symbol:   variable middleName
           [exec]   location: class select_005faccount_005fworker_jsp
           [exec] /opt/dev/projects/github/liferay-portal-7.0.x/modules/private/apps/osb-customer/osb-portlet/20200524231843764/src/org/apache/jsp/admin/select_005faccount_005fworker_jsp.java:658: error: cannot find symbol
           [exec] 						searchContainer.setTotal(UserLocalServiceUtil.searchCount(themeDisplay.getCompanyId(), firstName, middleName, lastName, screenName, emailAddress, WorkflowConstants.STATUS_ANY, userParams, true));
           [exec] 						                                                                                                              ^
           [exec]   symbol:   variable lastName
           [exec]   location: class select_005faccount_005fworker_jsp
           [exec] /opt/dev/projects/github/liferay-portal-7.0.x/modules/private/apps/osb-customer/osb-portlet/20200524231843764/src/org/apache/jsp/admin/select_005faccount_005fworker_jsp.java:658: error: cannot find symbol
           [exec] 						searchContainer.setTotal(UserLocalServiceUtil.searchCount(themeDisplay.getCompanyId(), firstName, middleName, lastName, screenName, emailAddress, WorkflowConstants.STATUS_ANY, userParams, true));
           [exec] 						                                                                                                                        ^
           [exec]   symbol:   variable screenName
           [exec]   location: class select_005faccount_005fworker_jsp
           [exec] /opt/dev/projects/github/liferay-portal-7.0.x/modules/private/apps/osb-customer/osb-portlet/20200524231843764/src/org/apache/jsp/admin/select_005faccount_005fworker_jsp.java:658: error: cannot find symbol
           [exec] 						searchContainer.setTotal(UserLocalServiceUtil.searchCount(themeDisplay.getCompanyId(), firstName, middleName, lastName, screenName, emailAddress, WorkflowConstants.STATUS_ANY, userParams, true));
           [exec] 						                                                                                                                                    ^
           [exec]   symbol:   variable emailAddress
           [exec]   location: class select_005faccount_005fworker_jsp
           [exec] /opt/dev/projects/github/liferay-portal-7.0.x/modules/private/apps/osb-customer/osb-portlet/20200524231843764/src/org/apache/jsp/admin/select_005faccount_005fworker_jsp.java:659: error: cannot find symbol
           [exec] 						searchContainer.setResults(UserLocalServiceUtil.search(themeDisplay.getCompanyId(), firstName, middleName, lastName, screenName, emailAddress, WorkflowConstants.STATUS_ANY, userParams, true, searchContainer.getStart(), searchContainer.getEnd(), new UserFirstNameComparator(true)));
           [exec] 						                                                                                    ^
           [exec]   symbol:   variable firstName
           [exec]   location: class select_005faccount_005fworker_jsp
           [exec] /opt/dev/projects/github/liferay-portal-7.0.x/modules/private/apps/osb-customer/osb-portlet/20200524231843764/src/org/apache/jsp/admin/select_005faccount_005fworker_jsp.java:659: error: cannot find symbol
           [exec] 						searchContainer.setResults(UserLocalServiceUtil.search(themeDisplay.getCompanyId(), firstName, middleName, lastName, screenName, emailAddress, WorkflowConstants.STATUS_ANY, userParams, true, searchContainer.getStart(), searchContainer.getEnd(), new UserFirstNameComparator(true)));
           [exec] 						                                                                                               ^
           [exec]   symbol:   variable middleName
           [exec]   location: class select_005faccount_005fworker_jsp
           [exec] /opt/dev/projects/github/liferay-portal-7.0.x/modules/private/apps/osb-customer/osb-portlet/20200524231843764/src/org/apache/jsp/admin/select_005faccount_005fworker_jsp.java:659: error: cannot find symbol
           [exec] 						searchContainer.setResults(UserLocalServiceUtil.search(themeDisplay.getCompanyId(), firstName, middleName, lastName, screenName, emailAddress, WorkflowConstants.STATUS_ANY, userParams, true, searchContainer.getStart(), searchContainer.getEnd(), new UserFirstNameComparator(true)));
           [exec] 						                                                                                                           ^
           [exec]   symbol:   variable lastName
           [exec]   location: class select_005faccount_005fworker_jsp
           [exec] /opt/dev/projects/github/liferay-portal-7.0.x/modules/private/apps/osb-customer/osb-portlet/20200524231843764/src/org/apache/jsp/admin/select_005faccount_005fworker_jsp.java:659: error: cannot find symbol
           [exec] 						searchContainer.setResults(UserLocalServiceUtil.search(themeDisplay.getCompanyId(), firstName, middleName, lastName, screenName, emailAddress, WorkflowConstants.STATUS_ANY, userParams, true, searchContainer.getStart(), searchContainer.getEnd(), new UserFirstNameComparator(true)));
           [exec] 						                                                                                                                     ^
           [exec]   symbol:   variable screenName
           [exec]   location: class select_005faccount_005fworker_jsp
           [exec] /opt/dev/projects/github/liferay-portal-7.0.x/modules/private/apps/osb-customer/osb-portlet/20200524231843764/src/org/apache/jsp/admin/select_005faccount_005fworker_jsp.java:659: error: cannot find symbol
           [exec] 						searchContainer.setResults(UserLocalServiceUtil.search(themeDisplay.getCompanyId(), firstName, middleName, lastName, screenName, emailAddress, WorkflowConstants.STATUS_ANY, userParams, true, searchContainer.getStart(), searchContainer.getEnd(), new UserFirstNameComparator(true)));
           [exec] 						                                                                                                                                 ^
           [exec]   symbol:   variable emailAddress
           [exec]   location: class select_005faccount_005fworker_jsp
           [exec] /opt/dev/projects/github/liferay-portal-7.0.x/modules/private/apps/osb-customer/osb-portlet/20200524231843764/src/org/apache/jsp/admin/select_005fuser_jsp.java:651: error: cannot find symbol
           [exec] 					searchContainer.setTotal(UserLocalServiceUtil.searchCount(themeDisplay.getCompanyId(), firstName, middleName, lastName, screenName, emailAddress, WorkflowConstants.STATUS_ANY, userParams, true));
           [exec] 					                                                                                       ^
           [exec]   symbol:   variable firstName
           [exec]   location: class select_005fuser_jsp
           [exec] /opt/dev/projects/github/liferay-portal-7.0.x/modules/private/apps/osb-customer/osb-portlet/20200524231843764/src/org/apache/jsp/admin/select_005fuser_jsp.java:651: error: cannot find symbol
           [exec] 					searchContainer.setTotal(UserLocalServiceUtil.searchCount(themeDisplay.getCompanyId(), firstName, middleName, lastName, screenName, emailAddress, WorkflowConstants.STATUS_ANY, userParams, true));
           [exec] 					                                                                                                  ^
           [exec]   symbol:   variable middleName
           [exec]   location: class select_005fuser_jsp
           [exec] /opt/dev/projects/github/liferay-portal-7.0.x/modules/private/apps/osb-customer/osb-portlet/20200524231843764/src/org/apache/jsp/admin/select_005fuser_jsp.java:651: error: cannot find symbol
           [exec] 					searchContainer.setTotal(UserLocalServiceUtil.searchCount(themeDisplay.getCompanyId(), firstName, middleName, lastName, screenName, emailAddress, WorkflowConstants.STATUS_ANY, userParams, true));
           [exec] 					                                                                                                              ^
           [exec]   symbol:   variable lastName
           [exec]   location: class select_005fuser_jsp
           [exec] /opt/dev/projects/github/liferay-portal-7.0.x/modules/private/apps/osb-customer/osb-portlet/20200524231843764/src/org/apache/jsp/admin/select_005fuser_jsp.java:651: error: cannot find symbol
           [exec] 					searchContainer.setTotal(UserLocalServiceUtil.searchCount(themeDisplay.getCompanyId(), firstName, middleName, lastName, screenName, emailAddress, WorkflowConstants.STATUS_ANY, userParams, true));
           [exec] 					                                                                                                                        ^
           [exec]   symbol:   variable screenName
           [exec]   location: class select_005fuser_jsp
           [exec] /opt/dev/projects/github/liferay-portal-7.0.x/modules/private/apps/osb-customer/osb-portlet/20200524231843764/src/org/apache/jsp/admin/select_005fuser_jsp.java:651: error: cannot find symbol
           [exec] 					searchContainer.setTotal(UserLocalServiceUtil.searchCount(themeDisplay.getCompanyId(), firstName, middleName, lastName, screenName, emailAddress, WorkflowConstants.STATUS_ANY, userParams, true));
           [exec] 					                                                                                                                                    ^
           [exec]   symbol:   variable emailAddress
           [exec]   location: class select_005fuser_jsp
           [exec] /opt/dev/projects/github/liferay-portal-7.0.x/modules/private/apps/osb-customer/osb-portlet/20200524231843764/src/org/apache/jsp/admin/select_005fuser_jsp.java:652: error: cannot find symbol
           [exec] 					searchContainer.setResults(UserLocalServiceUtil.search(themeDisplay.getCompanyId(), firstName, middleName, lastName, screenName, emailAddress, WorkflowConstants.STATUS_ANY, userParams, true, searchContainer.getStart(), searchContainer.getEnd(), new UserFirstNameComparator(true)));
           [exec] 					                                                                                    ^
           [exec]   symbol:   variable firstName
           [exec]   location: class select_005fuser_jsp
           [exec] /opt/dev/projects/github/liferay-portal-7.0.x/modules/private/apps/osb-customer/osb-portlet/20200524231843764/src/org/apache/jsp/admin/select_005fuser_jsp.java:652: error: cannot find symbol
           [exec] 					searchContainer.setResults(UserLocalServiceUtil.search(themeDisplay.getCompanyId(), firstName, middleName, lastName, screenName, emailAddress, WorkflowConstants.STATUS_ANY, userParams, true, searchContainer.getStart(), searchContainer.getEnd(), new UserFirstNameComparator(true)));
           [exec] 					                                                                                               ^
           [exec]   symbol:   variable middleName
           [exec]   location: class select_005fuser_jsp
           [exec] /opt/dev/projects/github/liferay-portal-7.0.x/modules/private/apps/osb-customer/osb-portlet/20200524231843764/src/org/apache/jsp/admin/select_005fuser_jsp.java:652: error: cannot find symbol
           [exec] 					searchContainer.setResults(UserLocalServiceUtil.search(themeDisplay.getCompanyId(), firstName, middleName, lastName, screenName, emailAddress, WorkflowConstants.STATUS_ANY, userParams, true, searchContainer.getStart(), searchContainer.getEnd(), new UserFirstNameComparator(true)));
           [exec] 					                                                                                                           ^
           [exec]   symbol:   variable lastName
           [exec]   location: class select_005fuser_jsp
           [exec] /opt/dev/projects/github/liferay-portal-7.0.x/modules/private/apps/osb-customer/osb-portlet/20200524231843764/src/org/apache/jsp/admin/select_005fuser_jsp.java:652: error: cannot find symbol
           [exec] 					searchContainer.setResults(UserLocalServiceUtil.search(themeDisplay.getCompanyId(), firstName, middleName, lastName, screenName, emailAddress, WorkflowConstants.STATUS_ANY, userParams, true, searchContainer.getStart(), searchContainer.getEnd(), new UserFirstNameComparator(true)));
           [exec] 					                                                                                                                     ^
           [exec]   symbol:   variable screenName
           [exec]   location: class select_005fuser_jsp
           [exec] /opt/dev/projects/github/liferay-portal-7.0.x/modules/private/apps/osb-customer/osb-portlet/20200524231843764/src/org/apache/jsp/admin/select_005fuser_jsp.java:652: error: cannot find symbol
           [exec] 					searchContainer.setResults(UserLocalServiceUtil.search(themeDisplay.getCompanyId(), firstName, middleName, lastName, screenName, emailAddress, WorkflowConstants.STATUS_ANY, userParams, true, searchContainer.getStart(), searchContainer.getEnd(), new UserFirstNameComparator(true)));
           [exec] 					                                                                                                                                 ^
           [exec]   symbol:   variable emailAddress
           [exec]   location: class select_005fuser_jsp
           [exec] /opt/dev/projects/github/liferay-portal-7.0.x/modules/private/apps/osb-customer/osb-portlet/20200524231843764/src/org/apache/jsp/license/select_005fuser_jsp.java:657: error: cannot find symbol
           [exec] 						searchContainer.setTotal(UserLocalServiceUtil.searchCount(themeDisplay.getCompanyId(), firstName, middleName, lastName, screenName, emailAddress, WorkflowConstants.STATUS_ANY, userParams, true));
           [exec] 						                                                                                       ^
           [exec]   symbol:   variable firstName
           [exec]   location: class select_005fuser_jsp
           [exec] /opt/dev/projects/github/liferay-portal-7.0.x/modules/private/apps/osb-customer/osb-portlet/20200524231843764/src/org/apache/jsp/license/select_005fuser_jsp.java:657: error: cannot find symbol
           [exec] 						searchContainer.setTotal(UserLocalServiceUtil.searchCount(themeDisplay.getCompanyId(), firstName, middleName, lastName, screenName, emailAddress, WorkflowConstants.STATUS_ANY, userParams, true));
           [exec] 						                                                                                                  ^
           [exec]   symbol:   variable middleName
           [exec]   location: class select_005fuser_jsp
           [exec] /opt/dev/projects/github/liferay-portal-7.0.x/modules/private/apps/osb-customer/osb-portlet/20200524231843764/src/org/apache/jsp/license/select_005fuser_jsp.java:657: error: cannot find symbol
           [exec] 						searchContainer.setTotal(UserLocalServiceUtil.searchCount(themeDisplay.getCompanyId(), firstName, middleName, lastName, screenName, emailAddress, WorkflowConstants.STATUS_ANY, userParams, true));
           [exec] 						                                                                                                              ^
           [exec]   symbol:   variable lastName
           [exec]   location: class select_005fuser_jsp
           [exec] /opt/dev/projects/github/liferay-portal-7.0.x/modules/private/apps/osb-customer/osb-portlet/20200524231843764/src/org/apache/jsp/license/select_005fuser_jsp.java:657: error: cannot find symbol
           [exec] 						searchContainer.setTotal(UserLocalServiceUtil.searchCount(themeDisplay.getCompanyId(), firstName, middleName, lastName, screenName, emailAddress, WorkflowConstants.STATUS_ANY, userParams, true));
           [exec] 						                                                                                                                        ^
           [exec]   symbol:   variable screenName
           [exec]   location: class select_005fuser_jsp
           [exec] /opt/dev/projects/github/liferay-portal-7.0.x/modules/private/apps/osb-customer/osb-portlet/20200524231843764/src/org/apache/jsp/license/select_005fuser_jsp.java:657: error: cannot find symbol
           [exec] 						searchContainer.setTotal(UserLocalServiceUtil.searchCount(themeDisplay.getCompanyId(), firstName, middleName, lastName, screenName, emailAddress, WorkflowConstants.STATUS_ANY, userParams, true));
           [exec] 						                                                                                                                                    ^
           [exec]   symbol:   variable emailAddress
           [exec]   location: class select_005fuser_jsp
           [exec] /opt/dev/projects/github/liferay-portal-7.0.x/modules/private/apps/osb-customer/osb-portlet/20200524231843764/src/org/apache/jsp/license/select_005fuser_jsp.java:658: error: cannot find symbol
           [exec] 						searchContainer.setResults(UserLocalServiceUtil.search(themeDisplay.getCompanyId(), firstName, middleName, lastName, screenName, emailAddress, WorkflowConstants.STATUS_ANY, userParams, true, searchContainer.getStart(), searchContainer.getEnd(), new UserFirstNameComparator(true)));
           [exec] 						                                                                                    ^
           [exec]   symbol:   variable firstName
           [exec]   location: class select_005fuser_jsp
           [exec] /opt/dev/projects/github/liferay-portal-7.0.x/modules/private/apps/osb-customer/osb-portlet/20200524231843764/src/org/apache/jsp/license/select_005fuser_jsp.java:658: error: cannot find symbol
           [exec] 						searchContainer.setResults(UserLocalServiceUtil.search(themeDisplay.getCompanyId(), firstName, middleName, lastName, screenName, emailAddress, WorkflowConstants.STATUS_ANY, userParams, true, searchContainer.getStart(), searchContainer.getEnd(), new UserFirstNameComparator(true)));
           [exec] 						                                                                                               ^
           [exec]   symbol:   variable middleName
           [exec]   location: class select_005fuser_jsp
           [exec] /opt/dev/projects/github/liferay-portal-7.0.x/modules/private/apps/osb-customer/osb-portlet/20200524231843764/src/org/apache/jsp/license/select_005fuser_jsp.java:658: error: cannot find symbol
           [exec] 						searchContainer.setResults(UserLocalServiceUtil.search(themeDisplay.getCompanyId(), firstName, middleName, lastName, screenName, emailAddress, WorkflowConstants.STATUS_ANY, userParams, true, searchContainer.getStart(), searchContainer.getEnd(), new UserFirstNameComparator(true)));
           [exec] 						                                                                                                           ^
           [exec]   symbol:   variable lastName
           [exec]   location: class select_005fuser_jsp
           [exec] /opt/dev/projects/github/liferay-portal-7.0.x/modules/private/apps/osb-customer/osb-portlet/20200524231843764/src/org/apache/jsp/license/select_005fuser_jsp.java:658: error: cannot find symbol
           [exec] 						searchContainer.setResults(UserLocalServiceUtil.search(themeDisplay.getCompanyId(), firstName, middleName, lastName, screenName, emailAddress, WorkflowConstants.STATUS_ANY, userParams, true, searchContainer.getStart(), searchContainer.getEnd(), new UserFirstNameComparator(true)));
           [exec] 						                                                                                                                     ^
           [exec]   symbol:   variable screenName
           [exec]   location: class select_005fuser_jsp
           [exec] /opt/dev/projects/github/liferay-portal-7.0.x/modules/private/apps/osb-customer/osb-portlet/20200524231843764/src/org/apache/jsp/license/select_005fuser_jsp.java:658: error: cannot find symbol
           [exec] 						searchContainer.setResults(UserLocalServiceUtil.search(themeDisplay.getCompanyId(), firstName, middleName, lastName, screenName, emailAddress, WorkflowConstants.STATUS_ANY, userParams, true, searchContainer.getStart(), searchContainer.getEnd(), new UserFirstNameComparator(true)));
           [exec] 						                                                                                                                                 ^
           [exec]   symbol:   variable emailAddress
           [exec]   location: class select_005fuser_jsp
           [exec] Note: Some input files use or override a deprecated API.
           [exec] Note: Recompile with -Xlint:deprecation for details.
           [exec] Note: Some input files use unchecked or unsafe operations.
           [exec] Note: Recompile with -Xlint:unchecked for details.
           [exec] 30 errors
           [exec] [ant:javac] Compile failed; see the compiler error output for details.
           [exec] 
           [exec] 
           [exec] FAILURE: Build failed with an exception.
           [exec] 
           [exec] * What went wrong:
           [exec] Execution failed for task ':private:apps:osb-customer:osb-portlet:compile-jsp'.
           [exec] > The following error occurred while executing this line:
           [exec]   /opt/dev/projects/github/liferay-portal-7.0.x/tools/sdk/build-common-plugin.xml:370: JSPs failed to compile.
           [exec] 
           [exec] * Try:
           [exec] Run with --info or --debug option to get more log output. Run with --scan to get full insights.
           [exec] 
           [exec] * Exception is:
           [exec] org.gradle.api.tasks.TaskExecutionException: Execution failed for task ':private:apps:osb-customer:osb-portlet:compile-jsp'.
           [exec] 	at org.gradle.api.internal.tasks.execution.ExecuteActionsTaskExecuter$3.accept(ExecuteActionsTaskExecuter.java:166)
           [exec] 	at org.gradle.api.internal.tasks.execution.ExecuteActionsTaskExecuter$3.accept(ExecuteActionsTaskExecuter.java:163)
           [exec] 	at org.gradle.internal.Try$Failure.ifSuccessfulOrElse(Try.java:191)
           [exec] 	at org.gradle.api.internal.tasks.execution.ExecuteActionsTaskExecuter.execute(ExecuteActionsTaskExecuter.java:156)
           [exec] 	at org.gradle.api.internal.tasks.execution.ValidatingTaskExecuter.execute(ValidatingTaskExecuter.java:62)
           [exec] 	at org.gradle.api.internal.tasks.execution.SkipEmptySourceFilesTaskExecuter.execute(SkipEmptySourceFilesTaskExecuter.java:108)
           [exec] 	at org.gradle.api.internal.tasks.execution.ResolveBeforeExecutionOutputsTaskExecuter.execute(ResolveBeforeExecutionOutputsTaskExecuter.java:67)
           [exec] 	at org.gradle.api.internal.tasks.execution.StartSnapshotTaskInputsBuildOperationTaskExecuter.execute(StartSnapshotTaskInputsBuildOperationTaskExecuter.java:62)
           [exec] 	at org.gradle.api.internal.tasks.execution.ResolveAfterPreviousExecutionStateTaskExecuter.execute(ResolveAfterPreviousExecutionStateTaskExecuter.java:46)
           [exec] 	at org.gradle.api.internal.tasks.execution.CleanupStaleOutputsExecuter.execute(CleanupStaleOutputsExecuter.java:94)
           [exec] 	at org.gradle.api.internal.tasks.execution.FinalizePropertiesTaskExecuter.execute(FinalizePropertiesTaskExecuter.java:46)
           [exec] 	at org.gradle.api.internal.tasks.execution.ResolveTaskExecutionModeExecuter.execute(ResolveTaskExecutionModeExecuter.java:95)
           [exec] 	at org.gradle.api.internal.tasks.execution.SkipTaskWithNoActionsExecuter.execute(SkipTaskWithNoActionsExecuter.java:57)
           [exec] 	at org.gradle.api.internal.tasks.execution.SkipOnlyIfTaskExecuter.execute(SkipOnlyIfTaskExecuter.java:56)
           [exec] 	at org.gradle.api.internal.tasks.execution.CatchExceptionTaskExecuter.execute(CatchExceptionTaskExecuter.java:36)
           [exec] 	at org.gradle.api.internal.tasks.execution.EventFiringTaskExecuter$1.executeTask(EventFiringTaskExecuter.java:77)
           [exec] 	at org.gradle.api.internal.tasks.execution.EventFiringTaskExecuter$1.call(EventFiringTaskExecuter.java:55)
           [exec] 	at org.gradle.api.internal.tasks.execution.EventFiringTaskExecuter$1.call(EventFiringTaskExecuter.java:52)
           [exec] 	at org.gradle.internal.operations.DefaultBuildOperationExecutor$CallableBuildOperationWorker.execute(DefaultBuildOperationExecutor.java:416)
           [exec] 	at org.gradle.internal.operations.DefaultBuildOperationExecutor$CallableBuildOperationWorker.execute(DefaultBuildOperationExecutor.java:406)
           [exec] 	at org.gradle.internal.operations.DefaultBuildOperationExecutor$1.execute(DefaultBuildOperationExecutor.java:165)
           [exec] 	at org.gradle.internal.operations.DefaultBuildOperationExecutor.execute(DefaultBuildOperationExecutor.java:250)
           [exec] 	at org.gradle.internal.operations.DefaultBuildOperationExecutor.execute(DefaultBuildOperationExecutor.java:158)
           [exec] 	at org.gradle.internal.operations.DefaultBuildOperationExecutor.call(DefaultBuildOperationExecutor.java:102)
           [exec] 	at org.gradle.internal.operations.DelegatingBuildOperationExecutor.call(DelegatingBuildOperationExecutor.java:36)
           [exec] 	at org.gradle.api.internal.tasks.execution.EventFiringTaskExecuter.execute(EventFiringTaskExecuter.java:52)
           [exec] 	at org.gradle.execution.plan.LocalTaskNodeExecutor.execute(LocalTaskNodeExecutor.java:43)
           [exec] 	at org.gradle.execution.taskgraph.DefaultTaskExecutionGraph$InvokeNodeExecutorsAction.execute(DefaultTaskExecutionGraph.java:355)
           [exec] 	at org.gradle.execution.taskgraph.DefaultTaskExecutionGraph$InvokeNodeExecutorsAction.execute(DefaultTaskExecutionGraph.java:343)
           [exec] 	at org.gradle.execution.taskgraph.DefaultTaskExecutionGraph$BuildOperationAwareExecutionAction.execute(DefaultTaskExecutionGraph.java:336)
           [exec] 	at org.gradle.execution.taskgraph.DefaultTaskExecutionGraph$BuildOperationAwareExecutionAction.execute(DefaultTaskExecutionGraph.java:322)
           [exec] 	at org.gradle.execution.plan.DefaultPlanExecutor$ExecutorWorker$1.execute(DefaultPlanExecutor.java:134)
           [exec] 	at org.gradle.execution.plan.DefaultPlanExecutor$ExecutorWorker$1.execute(DefaultPlanExecutor.java:129)
           [exec] 	at org.gradle.execution.plan.DefaultPlanExecutor$ExecutorWorker.execute(DefaultPlanExecutor.java:202)
           [exec] 	at org.gradle.execution.plan.DefaultPlanExecutor$ExecutorWorker.executeNextNode(DefaultPlanExecutor.java:193)
           [exec] 	at org.gradle.execution.plan.DefaultPlanExecutor$ExecutorWorker.run(DefaultPlanExecutor.java:129)
           [exec] 	at org.gradle.internal.concurrent.ExecutorPolicy$CatchAndRecordFailures.onExecute(ExecutorPolicy.java:64)
           [exec] 	at org.gradle.internal.concurrent.ManagedExecutorImpl$1.run(ManagedExecutorImpl.java:48)
           [exec] 	at org.gradle.internal.concurrent.ThreadFactoryImpl$ManagedThreadRunnable.run(ThreadFactoryImpl.java:56)
           [exec] Caused by: /opt/dev/projects/github/liferay-portal-7.0.x/tools/sdk/build-common-plugin.xml:604: The following error occurred while executing this line:
           [exec] /opt/dev/projects/github/liferay-portal-7.0.x/tools/sdk/build-common-plugin.xml:370: JSPs failed to compile.
           [exec] 	at org.apache.tools.ant.ProjectHelper.addLocationToBuildException(ProjectHelper.java:585)
           [exec] 	at org.apache.tools.ant.taskdefs.MacroInstance.execute(MacroInstance.java:404)
           [exec] 	at org.apache.tools.ant.UnknownElement.execute(UnknownElement.java:293)
           [exec] 	at org.apache.tools.ant.dispatch.DispatchUtils.execute(DispatchUtils.java:106)
           [exec] 	at org.apache.tools.ant.Task.perform(Task.java:352)
           [exec] 	at org.apache.tools.ant.taskdefs.Sequential.execute(Sequential.java:67)
           [exec] 	at net.sf.antcontrib.logic.IfTask.execute(IfTask.java:217)
           [exec] 	at org.apache.tools.ant.dispatch.DispatchUtils.execute(DispatchUtils.java:106)
           [exec] 	at org.apache.tools.ant.TaskAdapter.execute(TaskAdapter.java:155)
           [exec] 	at org.apache.tools.ant.UnknownElement.execute(UnknownElement.java:293)
           [exec] 	at org.apache.tools.ant.dispatch.DispatchUtils.execute(DispatchUtils.java:106)
           [exec] 	at org.apache.tools.ant.Task.perform(Task.java:352)
           [exec] 	at org.apache.tools.ant.taskdefs.Sequential.execute(Sequential.java:67)
           [exec] 	at net.sf.antcontrib.logic.IfTask.execute(IfTask.java:197)
           [exec] 	at org.apache.tools.ant.dispatch.DispatchUtils.execute(DispatchUtils.java:106)
           [exec] 	at org.apache.tools.ant.TaskAdapter.execute(TaskAdapter.java:155)
           [exec] 	at org.apache.tools.ant.UnknownElement.execute(UnknownElement.java:293)
           [exec] 	at org.apache.tools.ant.dispatch.DispatchUtils.execute(DispatchUtils.java:106)
           [exec] 	at org.apache.tools.ant.Task.perform(Task.java:352)
      

        Attachments

          Activity

            People

            Assignee:
            support-lep@liferay.com SE Support
            Reporter:
            melody.wu Melody Wu
            Participants of an Issue:
            Recent user:
            Melody Wu
            Votes:
            0 Vote for this issue
            Watchers:
            0 Start watching this issue

              Dates

              Created:
              Updated:
              Days since last comment:
              22 weeks, 4 days ago

                Packages

                Version Package