Uploaded image for project: 'PUBLIC - Liferay Portal Community Edition'
  1. PUBLIC - Liferay Portal Community Edition
  2. LPS-115752

modules-integration-project-templates-jdk8 test-workspace modules not found

Details

    Description

      Found on Build 753 of 7.3 EE Development acceptance
      Jenkins

           [exec] com.liferay.project.templates.layout.template.ProjectTemplatesLayoutTemplatesTest > testBuildTemplateLayoutTemplate[Testcase-0: testing 7.0.6] FAILED
           [exec]     org.gradle.testkit.runner.UnexpectedBuildFailure: Unexpected build execution failure in /tmp/junit6961344570508945659/gradleWorkspacetest-workspace/test-workspace with arguments [-Dhttp.proxyHost=squid.lax.liferay.com, -Dhttp.proxyPort=3128, --stacktrace, :modules:foo:build]
           [exec] 
           [exec]     Output:
           [exec] 
           [exec]     FAILURE: Build failed with an exception.
           [exec] 
           [exec]     * What went wrong:
           [exec]     Project 'modules' not found in root project 'test-workspace'.
           [exec] 
           [exec]     * Try:
           [exec]     Run with --info or --debug option to get more log output. Run with --scan to get full insights.
           [exec] 
           [exec]     * Exception is:
           [exec]     org.gradle.execution.taskpath.ProjectFinderByTaskPath$ProjectLookupException: Project 'modules' not found in root project 'test-workspace'.
       
      

      Attachments

        Activity

          People

            support-lep@liferay.com SE Support
            michael.eguina Michael Eguina (Inactive)
            Marta Elicegui Marta Elicegui
            Votes:
            0 Vote for this issue
            Watchers:
            0 Start watching this issue

            Dates

              Created:
              Updated:
              Resolved:
              24 weeks, 5 days ago

              Packages

                Version Package