Uploaded image for project: 'PUBLIC - Liferay Portal Community Edition'
  1. PUBLIC - Liferay Portal Community Edition
  2. LPS-118945

ruby-sass-compiler-jdk8 fails on 7.0.x CI tester

    Details

    • Fix Priority:
      4

      Description

      For ruby-sass-compiler-jdk8 batch :

        [exec] 
           [exec] > Task :dxp:apps:osb:osb-testray:osb-testray-dashboard:osb-testray-dashboard-web:buildCSS FAILED
           [exec] Using Ruby Sass compiler
           [exec] Gradle build finished at 2020-08-11 07:49:31.936.
           [exec] 218 actionable tasks: 218 executed
           [exec] Sass::SyntaxError: Invalid US-ASCII character "\xE2"
           [exec]   find_encoding_error at uri:classloader:/gems/sass-3.5.5/lib/sass/util.rb:1043
           [exec]                  each at org/jruby/RubyArray.java:1792
           [exec]       each_with_index at org/jruby/RubyEnumerable.java:1194
           [exec]   find_encoding_error at uri:classloader:/gems/sass-3.5.5/lib/sass/util.rb:1039
           [exec]   check_sass_encoding at uri:classloader:/gems/sass-3.5.5/lib/sass/util.rb:767
           [exec]       check_encoding! at uri:classloader:/gems/sass-3.5.5/lib/sass/engine.rb:444
           [exec]              _to_tree at uri:classloader:/gems/sass-3.5.5/lib/sass/engine.rb:400
           [exec]               to_tree at uri:classloader:/gems/sass-3.5.5/lib/sass/engine.rb:321
           [exec]          visit_import at uri:classloader:/gems/sass-3.5.5/lib/sass/tree/visitors/perform.rb:327
           [exec]           with_import at uri:classloader:/gems/sass-3.5.5/lib/sass/stack.rb:88
           [exec]            with_frame at uri:classloader:/gems/sass-3.5.5/lib/sass/stack.rb:135
           [exec]           with_import at uri:classloader:/gems/sass-3.5.5/lib/sass/stack.rb:88
           [exec]          visit_import at uri:classloader:/gems/sass-3.5.5/lib/sass/tree/visitors/perform.rb:326
           [exec]                 visit at uri:classloader:/gems/sass-3.5.5/lib/sass/tree/visitors/base.rb:36
           [exec]                 visit at uri:classloader:/gems/sass-3.5.5/lib/sass/tree/visitors/perform.rb:162
           [exec]             with_base at uri:classloader:/gems/sass-3.5.5/lib/sass/stack.rb:79
           [exec]            with_frame at uri:classloader:/gems/sass-3.5.5/lib/sass/stack.rb:135
           [exec]             with_base at uri:classloader:/gems/sass-3.5.5/lib/sass/stack.rb:79
           [exec]                 visit at uri:classloader:/gems/sass-3.5.5/lib/sass/tree/visitors/perform.rb:162
           [exec]        visit_children at uri:classloader:/gems/sass-3.5.5/lib/sass/tree/visitors/base.rb:52
           [exec]                   map at org/jruby/RubyArray.java:2577
           [exec]        visit_children at uri:classloader:/gems/sass-3.5.5/lib/sass/tree/visitors/base.rb:52
           [exec]        visit_children at uri:classloader:/gems/sass-3.5.5/lib/sass/tree/visitors/perform.rb:171
           [exec]      with_environment at uri:classloader:/gems/sass-3.5.5/lib/sass/tree/visitors/perform.rb:183
           [exec]        visit_children at uri:classloader:/gems/sass-3.5.5/lib/sass/tree/visitors/perform.rb:170
           [exec]                 visit at uri:classloader:/gems/sass-3.5.5/lib/sass/tree/visitors/base.rb:36
           [exec]            visit_root at uri:classloader:/gems/sass-3.5.5/lib/sass/tree/visitors/perform.rb:190
           [exec]                 visit at uri:classloader:/gems/sass-3.5.5/lib/sass/tree/visitors/base.rb:36
           [exec]                 visit at uri:classloader:/gems/sass-3.5.5/lib/sass/tree/visitors/perform.rb:161
           [exec]                 visit at uri:classloader:/gems/sass-3.5.5/lib/sass/tree/visitors/perform.rb:10
           [exec]              css_tree at uri:classloader:/gems/sass-3.5.5/lib/sass/tree/root_node.rb:36
           [exec]                render at uri:classloader:/gems/sass-3.5.5/lib/sass/tree/root_node.rb:20
           [exec]                render at uri:classloader:/gems/sass-3.5.5/lib/sass/engine.rb:290
           [exec]               process at <script>:55
           [exec] 
           [exec] 
           [exec] FAILURE: Build failed with an exception.
           [exec] 
           [exec] * What went wrong:
           [exec] Execution failed for task ':dxp:apps:osb:osb-testray:osb-testray-dashboard:osb-testray-dashboard-web:buildCSS'.
           [exec] > com.liferay.sass.compiler.ruby.internal.RubySassCompilerException: Unable to parse /opt/dev/projects/github/liferay-portal-7.0.x/modules/dxp/apps/osb/osb-testray/osb-testray-dashboard/osb-testray-dashboard-web/build/tmp/copyCSS/META-INF/resources/dashboard/css/main.scss
           [exec] 
           [exec] * Try:
           [exec] Run with --info or --debug option to get more log output. Run with --scan to get full insights.
           [exec] 
           [exec] * Exception is:
           [exec] org.gradle.api.tasks.TaskExecutionException: Execution failed for task ':dxp:apps:osb:osb-testray:osb-testray-dashboard:osb-testray-dashboard-web:buildCSS'.
           [exec] 	at org.gradle.api.internal.tasks.execution.ExecuteActionsTaskExecuter$3.accept(ExecuteActionsTaskExecuter.java:166)
           [exec] 	at org.gradle.api.internal.tasks.execution.ExecuteActionsTaskExecuter$3.accept(ExecuteActionsTaskExecuter.java:163)
           [exec] 	at org.gradle.internal.Try$Failure.ifSuccessfulOrElse(Try.java:191)
           [exec] 	at org.gradle.api.internal.tasks.execution.ExecuteActionsTaskExecuter.execute(ExecuteActionsTaskExecuter.java:156)
           [exec] 	at org.gradle.api.internal.tasks.execution.ValidatingTaskExecuter.execute(ValidatingTaskExecuter.java:62)
           [exec] 	at org.gradle.api.internal.tasks.execution.SkipEmptySourceFilesTaskExecuter.execute(SkipEmptySourceFilesTaskExecuter.java:108)
           [exec] 	at org.gradle.api.internal.tasks.execution.ResolveBeforeExecutionOutputsTaskExecuter.execute(ResolveBeforeExecutionOutputsTaskExecuter.java:67)
           [exec] 	at org.gradle.api.internal.tasks.execution.StartSnapshotTaskInputsBuildOperationTaskExecuter.execute(StartSnapshotTaskInputsBuildOperationTaskExecuter.java:62)
           [exec] 	at org.gradle.api.internal.tasks.execution.ResolveAfterPreviousExecutionStateTaskExecuter.execute(ResolveAfterPreviousExecutionStateTaskExecuter.java:46)
           [exec] 	at org.gradle.api.internal.tasks.execution.CleanupStaleOutputsExecuter.execute(CleanupStaleOutputsExecuter.java:94)
           [exec] 	at org.gradle.api.internal.tasks.execution.FinalizePropertiesTaskExecuter.execute(FinalizePropertiesTaskExecuter.java:46)
           [exec] 	at org.gradle.api.internal.tasks.execution.ResolveTaskExecutionModeExecuter.execute(ResolveTaskExecutionModeExecuter.java:95)
           [exec] 	at org.gradle.api.internal.tasks.execution.SkipTaskWithNoActionsExecuter.execute(SkipTaskWithNoActionsExecuter.java:57)
           [exec] 	at org.gradle.api.internal.tasks.execution.SkipOnlyIfTaskExecuter.execute(SkipOnlyIfTaskExecuter.java:56)
           [exec] 	at org.gradle.api.internal.tasks.execution.CatchExceptionTaskExecuter.execute(CatchExceptionTaskExecuter.java:36)
           [exec] 	at org.gradle.api.internal.tasks.execution.EventFiringTaskExecuter$1.executeTask(EventFiringTaskExecuter.java:77)
           [exec] 	at org.gradle.api.internal.tasks.execution.EventFiringTaskExecuter$1.call(EventFiringTaskExecuter.java:55)
           [exec] 	at org.gradle.api.internal.tasks.execution.EventFiringTaskExecuter$1.call(EventFiringTaskExecuter.java:52)
           [exec] 	at org.gradle.internal.operations.DefaultBuildOperationExecutor$CallableBuildOperationWorker.execute(DefaultBuildOperationExecutor.java:416)
           [exec] 	at org.gradle.internal.operations.DefaultBuildOperationExecutor$CallableBuildOperationWorker.execute(DefaultBuildOperationExecutor.java:406)
           [exec] 	at org.gradle.internal.operations.DefaultBuildOperationExecutor$1.execute(DefaultBuildOperationExecutor.java:165)
           [exec] 	at org.gradle.internal.operations.DefaultBuildOperationExecutor.execute(DefaultBuildOperationExecutor.java:250)
           [exec] 	at org.gradle.internal.operations.DefaultBuildOperationExecutor.execute(DefaultBuildOperationExecutor.java:158)
           [exec] 	at org.gradle.internal.operations.DefaultBuildOperationExecutor.call(DefaultBuildOperationExecutor.java:102)
           [exec] 	at org.gradle.internal.operations.DelegatingBuildOperationExecutor.call(DelegatingBuildOperationExecutor.java:36)
           [exec] 	at org.gradle.api.internal.tasks.execution.EventFiringTaskExecuter.execute(EventFiringTaskExecuter.java:52)
           [exec] 	at org.gradle.execution.plan.LocalTaskNodeExecutor.execute(LocalTaskNodeExecutor.java:43)
           [exec] 	at org.gradle.execution.taskgraph.DefaultTaskExecutionGraph$InvokeNodeExecutorsAction.execute(DefaultTaskExecutionGraph.java:355)
           [exec] 	at org.gradle.execution.taskgraph.DefaultTaskExecutionGraph$InvokeNodeExecutorsAction.execute(DefaultTaskExecutionGraph.java:343)
           [exec] 	at org.gradle.execution.taskgraph.DefaultTaskExecutionGraph$BuildOperationAwareExecutionAction.execute(DefaultTaskExecutionGraph.java:336)
           [exec] 	at org.gradle.execution.taskgraph.DefaultTaskExecutionGraph$BuildOperationAwareExecutionAction.execute(DefaultTaskExecutionGraph.java:322)
           [exec] 	at org.gradle.execution.plan.DefaultPlanExecutor$ExecutorWorker$1.execute(DefaultPlanExecutor.java:134)
           [exec] 	at org.gradle.execution.plan.DefaultPlanExecutor$ExecutorWorker$1.execute(DefaultPlanExecutor.java:129)
           [exec] 	at org.gradle.execution.plan.DefaultPlanExecutor$ExecutorWorker.execute(DefaultPlanExecutor.java:202)
           [exec] 	at org.gradle.execution.plan.DefaultPlanExecutor$ExecutorWorker.executeNextNode(DefaultPlanExecutor.java:193)
           [exec] 	at org.gradle.execution.plan.DefaultPlanExecutor$ExecutorWorker.run(DefaultPlanExecutor.java:129)
           [exec] 	at org.gradle.internal.concurrent.ExecutorPolicy$CatchAndRecordFailures.onExecute(ExecutorPolicy.java:64)
           [exec] 	at org.gradle.internal.concurrent.ManagedExecutorImpl$1.run(ManagedExecutorImpl.java:48)
           [exec] 	at org.gradle.internal.concurrent.ThreadFactoryImpl$ManagedThreadRunnable.run(ThreadFactoryImpl.java:56)
           [exec] Caused by: org.gradle.internal.UncheckedException: com.liferay.sass.compiler.ruby.internal.RubySassCompilerException: Unable to parse /opt/dev/projects/github/liferay-portal-7.0.x/modules/dxp/apps/osb/osb-testray/osb-testray-dashboard/osb-testray-dashboard-web/build/tmp/copyCSS/META-INF/resources/dashboard/css/main.scss
           [exec] 	at org.gradle.internal.UncheckedException.throwAsUncheckedException(UncheckedException.java:67)
           [exec] 	at org.gradle.internal.UncheckedException.throwAsUncheckedException(UncheckedException.java:41)
           [exec] 	at org.gradle.internal.reflect.JavaMethod.invoke(JavaMethod.java:106)
           [exec] 	at org.gradle.api.internal.project.taskfactory.StandardTaskAction.doExecute(StandardTaskAction.java:49)
      

        Attachments

          Activity

            People

            Assignee:
            support-lep@liferay.com SE Support
            Reporter:
            melody.wu Melody Wu
            Participants of an Issue:
            Recent user:
            Brian Wulbern
            Votes:
            0 Vote for this issue
            Watchers:
            1 Start watching this issue

              Dates

              Created:
              Updated:
              Days since last comment:
              14 weeks, 6 days ago

                Packages

                Version Package