Uploaded image for project: 'PUBLIC - Liferay Portal Community Edition'
  1. PUBLIC - Liferay Portal Community Edition
  2. LPS-119347

Test com.liferay.portal.modules.ModulesStructureTest FAILED on central-requirements-jdk8

    Details

    • Fix Priority:
      3

      Description

          [junit] Testcase: testScanBuildScripts(com.liferay.portal.modules.ModulesStructureTest):	FAILED
          [junit] Version must match the project version (3.0.0) modules/apps/frontend-js/frontend-js-tooltip-support-web/package.json
          [junit] junit.framework.AssertionFailedError: Version must match the project version (3.0.0) modules/apps/frontend-js/frontend-js-tooltip-support-web/package.json
          [junit] 	at com.liferay.portal.modules.ModulesStructureTest._testJSONVersion(ModulesStructureTest.java:1486)
          [junit] 	at com.liferay.portal.modules.ModulesStructureTest.access$500(ModulesStructureTest.java:66)
          [junit] 	at com.liferay.portal.modules.ModulesStructureTest$1.preVisitDirectory(ModulesStructureTest.java:255)
          [junit] 	at com.liferay.portal.modules.ModulesStructureTest$1.preVisitDirectory(ModulesStructureTest.java:122)
          [junit] 	at java.nio.file.Files.walkFileTree(Files.java:2677)
          [junit] 	at java.nio.file.Files.walkFileTree(Files.java:2742)
          [junit] 	at com.liferay.portal.modules.ModulesStructureTest.testScanBuildScripts(ModulesStructureTest.java:120)
          [junit] 
          [junit] 
          [junit] Test com.liferay.portal.modules.ModulesStructureTest FAILED
      

        Attachments

          Activity

            People

            Assignee:
            linda.sui Linda Sui
            Reporter:
            linda.sui Linda Sui
            Participants of an Issue:
            Recent user:
            Jason Pince
            Votes:
            0 Vote for this issue
            Watchers:
            0 Start watching this issue

              Dates

              Created:
              Updated:
              Resolved:
              Days since last comment:
              1 year, 4 weeks, 2 days ago

                Packages

                Version Package
                7.3.5 CE GA6
                7.3.10 DXP GA1
                Master