Uploaded image for project: 'PUBLIC - Liferay Portal Community Edition'
  1. PUBLIC - Liferay Portal Community Edition
  2. LPS-119578

Cannot switch database with Setup Wizard

    Details

      Description

      Testray

      Poshi

      Jenkins

       [exec]     BUILD FAILED: "Using dialect org.hibernate.dialect.Oracle10gDialect for Oracle" is not present in console
           [exec]     /opt/dev/projects/github/liferay-portal/portal-web/test/functional/com/liferay/portalweb/macros/SetupWizard.macro[viewConfiguredDatabaseInConsole]:227
           [exec]     /opt/dev/projects/github/liferay-portal/portal-web/test/functional/com/liferay/portalweb/macros/SetupWizard.macro[configurePG]:133
           [exec]     /opt/dev/projects/github/liferay-portal/portal-web/test/functional/com/liferay/portalweb/tests/coreinfrastructure/deployment/setupwizardee/SetupWizardHSQLEE.testcase[HSQLtoOracle]:67
           [exec] 
           [exec] 
           [exec] com.liferay.poshi.runner.PoshiRunner > test[LocalFile.SetupWizardHSQLEE#HSQLtoOracle] STANDARD_ERROR
           [exec]     java.lang.Exception: "Using dialect org.hibernate.dialect.Oracle10gDialect for Oracle" is not present in console
           [exec]     	at com.liferay.poshi.runner.selenium.BaseWebDriverImpl$Condition.assertTrue(BaseWebDriverImpl.java:4611)
           [exec]     	at com.liferay.poshi.runner.selenium.BaseWebDriverImpl.assertConsoleTextPresent(BaseWebDriverImpl.java:321)
           [exec]     	at sun.reflect.NativeMethodAccessorImpl.invoke0(Native Method)
           [exec]     	at sun.reflect.NativeMethodAccessorImpl.invoke(NativeMethodAccessorImpl.java:62)
           [exec]     	at sun.reflect.DelegatingMethodAccessorImpl.invoke(DelegatingMethodAccessorImpl.java:43)
           [exec]     	at java.lang.reflect.Method.invoke(Method.java:498)
           [exec]     	at com.liferay.poshi.runner.PoshiRunnerExecutor$1.call(PoshiRunnerExecutor.java:1222)
           [exec]     	at java.util.concurrent.FutureTask.run(FutureTask.java:266)
           [exec]     	at java.util.concurrent.ThreadPoolExecutor.runWorker(ThreadPoolExecutor.java:1142)
           [exec]     	at java.util.concurrent.ThreadPoolExecutor$Worker.run(ThreadPoolExecutor.java:617)
           [exec]     	at java.lang.Thread.run(Thread.java:745)
           [exec] 
           [exec] com.liferay.poshi.runner.PoshiRunner > test[LocalFile.SetupWizardHSQLEE#HSQLtoOracle] FAILED
           [exec]     java.lang.Exception
      

        Attachments

          Activity

            People

            Assignee:
            victor.ware Victor Ware
            Reporter:
            calvin.vo Calvin Vo
            Participants of an Issue:
            Recent user:
            Victor Ware
            Votes:
            0 Vote for this issue
            Watchers:
            0 Start watching this issue

              Dates

              Created:
              Updated:
              Resolved:
              Days since last comment:
              8 weeks ago

                Packages

                Version Package
                Master