Uploaded image for project: 'PUBLIC - Liferay Portal Community Edition'
  1. PUBLIC - Liferay Portal Community Edition
  2. LPS-120334

Version increase required for com.liferay.commerce.price.list.web-4.0.1.jar

    Details

    • Type: Regression Bug
    • Status: Closed
    • Resolution: No Longer Reproducible
    • Affects Version/s: Master
    • Fix Version/s: None
    • Labels:
    • Story Points:
      1

      Description

      Occurred on modules-semantic-versioning-jdk8/0 batch

          [exec] > Task :apps:commerce:commerce-price-list-web:baseline FAILED
           [exec]   PACKAGE_NAME                                       DELTA      CUR_VER    BASE_VER   REC_VER    WARNINGS  
           [exec] = ================================================== ========== ========== ========== ========== ==========
           [exec] * com.liferay.commerce.price.list.web.portlet.action CHANGED    1.0.0      1.0.0      1.0.1      VERSION INCREASE REQUIRED
           [exec] 	~   class      com.liferay.commerce.price.list.web.portlet.action.CommercePriceListActionHelper
           [exec] 		~   annotated  org.osgi.service.component.annotations.Component
           [exec] 			+   property   enabled=false
           [exec] [Baseline Report] Mode: diff (persisted)
           [exec] 
           [exec] > Task :apps:commerce:commerce-price-list-web:syncVersions
           [exec] Gradle build finished at 2020-09-02 22:15:55.233.
           [exec] 
           [exec] 
           [exec] FAILURE: Build failed with an exception.
           [exec] 
           [exec] * What went wrong:
           [exec] Execution failed for task ':apps:commerce:commerce-price-list-web:baseline'.
           [exec] > A failure occurred while executing com.liferay.gradle.plugins.baseline.internal.work.BaselineWorkAction
           [exec]    > org.gradle.api.GradleException: Semantic versioning is incorrect while checking /opt/dev/projects/github/liferay-portal/tools/sdk/dist/com.liferay.commerce.price.list.web-4.0.2.jar against /opt/dev/projects/github/liferay-portal/.gradle/caches/modules-2/files-2.1/com.liferay.commerce/com.liferay.commerce.price.list.web/4.0.1/20ebf65f1a18663dc6d6f14fce4ae577f017ffcb/com.liferay.commerce.price.list.web-4.0.1.jar
      

      full console log:
      https://testray.liferay.com/reports/production/logs/test-1-1/1599081019294/test-portal-testsuite-upstream(master)/270/modules-semantic-versioning-jdk8/0/jenkins-console.txt.gz

        Attachments

          Activity

            People

            Assignee:
            della.wang Della Wang (Inactive)
            Reporter:
            della.wang Della Wang (Inactive)
            Participants of an Issue:
            Recent user:
            Gábor Lovas
            Votes:
            0 Vote for this issue
            Watchers:
            0 Start watching this issue

              Dates

              Created:
              Updated:
              Resolved:
              Days since last comment:
              25 weeks, 4 days ago

                Packages

                Version Package