Uploaded image for project: 'PUBLIC - Liferay Portal Community Edition'
  1. PUBLIC - Liferay Portal Community Edition
  2. LPS-122108

Investigate failure in workflow processes

    Details

    • Type: Regression Bug
    • Status: Closed
    • Resolution: No Longer Reproducible
    • Affects Version/s: 7.3.X
    • Fix Version/s: None
    • Component/s: Workflow > Metrics
    • Fix Priority:
      3

      Description

      Testray

      Jenkins

        [exec] 
           [exec] com.liferay.poshi.runner.PoshiRunner > test[LocalFile.PortalSmoke#Smoke] STANDARD_ERROR
           [exec]     SLF4J: Failed to load class "org.slf4j.impl.StaticLoggerBinder".
           [exec]     SLF4J: Defaulting to no-operation (NOP) logger implementation
           [exec]     SLF4J: See http://www.slf4j.org/codes.html#StaticLoggerBinder for further details.
           [exec]     Starting ChromeDriver 2.37.544315 (730aa6a5fdba159ac9f4c1e8cbc59bf1b5ce12b7) on port 32603
           [exec]     Only local connections are allowed.
           [exec]     Oct 12, 2020 12:08:56 AM org.openqa.selenium.remote.ProtocolHandshake createSession
           [exec]     INFO: Detected dialect: OSS
           [exec] 
           [exec] com.liferay.poshi.runner.PoshiRunner > test[LocalFile.PortalSmoke#Smoke] STANDARD_OUT
           [exec]     LIFERAY_ERROR: java.lang.RuntimeException: org.elasticsearch.ElasticsearchStatusException: [liferay-20097-workflow-metrics-processes] ElasticsearchStatusException[Elasticsearch exception [type=index_not_found_exception, reason=no such index [liferay-20097-workflow-metrics-processes] and [action.auto_create_index] is [false]]]
           [exec]     Ensure that the super admin can add pages, add portlets, navigate to the product menu, use the WYSIWYG editor, and view alert messages.
           [exec] 
           [exec]     BUILD FAILED: 
           [exec]     ##
           [exec]     ## 1 Liferay Exception was thrown
           [exec]     ##
           [exec] 
           [exec]     LIFERAY_ERROR: java.lang.RuntimeException: org.elasticsearch.ElasticsearchStatusException: [liferay-20097-workflow-metrics-processes] ElasticsearchStatusException[Elasticsearch exception [type=index_not_found_exception, reason=no such index [liferay-20097-workflow-metrics-processes] and [action.auto_create_index] is [false]]]
           [exec] 
           [exec] 
           [exec]     /opt/dev/projects/github/liferay-portal-7.3.x/portal-web/test/functional/com/liferay/portalweb/tests/portalsmoke/PortalSmoke.testcase[Smoke]:33
           [exec] 
           [exec] 
           [exec] com.liferay.poshi.runner.PoshiRunner > test[LocalFile.PortalSmoke#Smoke] STANDARD_ERROR
           [exec]     java.lang.Exception: 
           [exec]     ##
           [exec]     ## 1 Liferay Exception was thrown
           [exec]     ##
           [exec] 
           [exec]     LIFERAY_ERROR: java.lang.RuntimeException: org.elasticsearch.ElasticsearchStatusException: [liferay-20097-workflow-metrics-processes] ElasticsearchStatusException[Elasticsearch exception [type=index_not_found_exception, reason=no such index [liferay-20097-workflow-metrics-processes] and [action.auto_create_index] is [false]]]
           [exec] 
           [exec] 
           [exec]     	at com.liferay.poshi.runner.selenium.LiferaySeleniumUtil.assertNoPoshiWarnings(LiferaySeleniumUtil.java:298)
           [exec]     	at com.liferay.poshi.runner.PoshiRunner.test(PoshiRunner.java:232)
           [exec]     	at sun.reflect.NativeMethodAccessorImpl.invoke0(Native Method)
           [exec]     	at sun.reflect.NativeMethodAccessorImpl.invoke(NativeMethodAccessorImpl.java:62)
           [exec]     	at sun.reflect.DelegatingMethodAccessorImpl.invoke(DelegatingMethodAccessorImpl.java:43)
           [exec]     	at java.lang.reflect.Method.invoke(Method.java:498)
           [exec]     	at org.junit.runners.model.FrameworkMethod$1.runReflectiveCall(FrameworkMethod.java:50)
           [exec]     	at org.junit.internal.runners.model.ReflectiveCallable.run(ReflectiveCallable.java:12)
           [exec]     	at org.junit.runners.model.FrameworkMethod.invokeExplosively(FrameworkMethod.java:47)
           [exec]     	at org.junit.internal.runners.statements.InvokeMethod.evaluate(InvokeMethod.java:17)
           [exec]     	at org.junit.internal.runners.statements.RunBefores.evaluate(RunBefores.java:26)
           [exec]     	at org.junit.internal.runners.statements.RunAfters.evaluate(RunAfters.java:27)
           [exec]     	at com.liferay.poshi.runner.PoshiRunner$RetryTestRule$RetryStatement.evaluate(PoshiRunner.java:345)
           [exec]     	at org.junit.rules.RunRules.evaluate(RunRules.java:20)
           [exec]     	at org.junit.runners.ParentRunner.runLeaf(ParentRunner.java:325)
           [exec]     	at org.junit.runners.BlockJUnit4ClassRunner.runChild(BlockJUnit4ClassRunner.java:78)
           [exec]     	at org.junit.runners.BlockJUnit4ClassRunner.runChild(BlockJUnit4ClassRunner.java:57)
           [exec]     	at org.junit.runners.ParentRunner$3.run(ParentRunner.java:290)
           [exec]     	at org.junit.runners.ParentRunner$1.schedule(ParentRunner.java:71)
           [exec]     	at org.junit.runners.ParentRunner.runChildren(ParentRunner.java:288)
           [exec]     	at org.junit.runners.ParentRunner.access$000(ParentRunner.java:58)
           [exec]     	at org.junit.runners.ParentRunner$2.evaluate(ParentRunner.java:268)
           [exec]     	at org.junit.runners.ParentRunner.run(ParentRunner.java:363)
           [exec]     	at org.junit.runners.Suite.runChild(Suite.java:128)
           [exec]     	at org.junit.runners.Suite.runChild(Suite.java:27)
           [exec]     	at org.junit.runners.ParentRunner$3.run(ParentRunner.java:290)
           [exec]     	at org.junit.runners.ParentRunner$1.schedule(ParentRunner.java:71)
           [exec]     	at org.junit.runners.ParentRunner.runChildren(ParentRunner.java:288)
           [exec]     	at org.junit.runners.ParentRunner.access$000(ParentRunner.java:58)
           [exec]     	at org.junit.runners.ParentRunner$2.evaluate(ParentRunner.java:268)
           [exec]     	at org.junit.internal.runners.statements.RunAfters.evaluate(RunAfters.java:27)
           [exec]     	at org.junit.runners.ParentRunner.run(ParentRunner.java:363)
           [exec]     	at org.gradle.api.internal.tasks.testing.junit.JUnitTestClassExecutor.runTestClass(JUnitTestClassExecutor.java:110)
           [exec]     	at org.gradle.api.internal.tasks.testing.junit.JUnitTestClassExecutor.execute(JUnitTestClassExecutor.java:58)
      

        Attachments

          Activity

            People

            Assignee:
            support-qa Support QA
            Reporter:
            calvin.vo Calvin Vo
            Participants of an Issue:
            Recent user:
            Brian Wulbern
            Votes:
            0 Vote for this issue
            Watchers:
            0 Start watching this issue

              Dates

              Created:
              Updated:
              Resolved:
              Days since last comment:
              35 weeks, 6 days ago

                Packages

                Version Package