Uploaded image for project: 'PUBLIC - Liferay Portal Community Edition'
  1. PUBLIC - Liferay Portal Community Edition
  2. LPS-122596

AppBuilderAppMVCResourceCommandTest failed with AssertionError

    Description

    Testray

    Jenkins

     [exec] com.liferay.app.builder.workflow.web.internal.portlet.action.test.DeleteAppBuilderAppMVCResourceCommandTest > testDeleteAppWorkflowWithIncompleteInstance FAILED
         [exec]     java.lang.AssertionError
         [exec]     	at org.junit.Assert.fail(Assert.java:86)
         [exec]     	at org.junit.Assert.assertTrue(Assert.java:41)
         [exec]     	at org.junit.Assert.assertFalse(Assert.java:64)
         [exec]     	at org.junit.Assert.assertFalse(Assert.java:74)
         [exec]     	at com.liferay.app.builder.workflow.web.internal.portlet.action.test.DeleteAppBuilderAppMVCResourceCommandTest.testDeleteAppWorkflowWithIncompleteInstance(DeleteAppBuilderAppMVCResourceCommandTest.java:57)
         [exec]     	at sun.reflect.NativeMethodAccessorImpl.invoke0(Native Method)
         [exec]     	at sun.reflect.NativeMethodAccessorImpl.invoke(NativeMethodAccessorImpl.java:62)
         [exec]     	at sun.reflect.DelegatingMethodAccessorImpl.invoke(DelegatingMethodAccessorImpl.java:43)
         [exec]     	at java.lang.reflect.Method.invoke(Method.java:498)
         [exec]     	at com.liferay.arquillian.extension.junit.bridge.server.TestExecutorRunnable$3.evaluate(TestExecutorRunnable.java:353)
         [exec]     	at org.junit.internal.runners.statements.RunBefores.evaluate(RunBefores.java:26)
         [exec]     	at com.liferay.portal.kernel.test.rule.AbstractTestRule$2.evaluate(AbstractTestRule.java:99)
         [exec]     	at com.liferay.portal.kernel.test.rule.AbstractTestRule$2.evaluate(AbstractTestRule.java:99)
         [exec]     	at com.liferay.portal.kernel.test.rule.AbstractTestRule$2.evaluate(AbstractTestRule.java:99)
         [exec]     	at com.liferay.portal.kernel.test.rule.AbstractTestRule$2.evaluate(AbstractTestRule.java:99)
         [exec]     	at com.liferay.portal.kernel.test.rule.AbstractTestRule$2.evaluate(AbstractTestRule.java:99)
         [exec]     	at com.liferay.portal.kernel.test.rule.AbstractTestRule$2.evaluate(AbstractTestRule.java:99)
         [exec]     	at org.junit.rules.RunRules.evaluate(RunRules.java:20)
         [exec]     	at com.liferay.arquillian.extension.junit.bridge.server.TestExecutorRunnable$1.evaluate(TestExecutorRunnable.java:237)
         [exec]     	at com.liferay.portal.kernel.test.rule.AbstractTestRule$1.evaluate(AbstractTestRule.java:59)
         [exec]     	at com.liferay.portal.kernel.test.rule.AbstractTestRule$1.evaluate(AbstractTestRule.java:59)
         [exec]     	at com.liferay.portal.kernel.test.rule.AbstractTestRule$1.evaluate(AbstractTestRule.java:59)
         [exec]     	at com.liferay.portal.kernel.test.rule.AbstractTestRule$1.evaluate(AbstractTestRule.java:59)
         [exec]     	at com.liferay.portal.kernel.test.rule.AbstractTestRule$1.evaluate(AbstractTestRule.java:59)
         [exec]     	at com.liferay.portal.kernel.test.rule.AbstractTestRule$1.evaluate(AbstractTestRule.java:59)
         [exec]     	at com.liferay.portal.kernel.test.rule.AbstractTestRule$1.evaluate(AbstractTestRule.java:59)
         [exec]     	at com.liferay.portal.kernel.test.rule.AbstractTestRule$1.evaluate(AbstractTestRule.java:59)
         [exec]     	at com.liferay.portal.kernel.test.rule.AbstractTestRule$1.evaluate(AbstractTestRule.java:59)
         [exec]     	at org.junit.rules.RunRules.evaluate(RunRules.java:20)
         [exec]     	at com.liferay.arquillian.extension.junit.bridge.server.TestExecutorRunnable._execute(TestExecutorRunnable.java:316)
         [exec]     	at com.liferay.arquillian.extension.junit.bridge.server.TestExecutorRunnable.run(TestExecutorRunnable.java:95)
         [exec]     	at java.lang.Thread.run(Thread.java:745)
         [exec] 
         [exec] com.liferay.app.builder.workflow.web.internal.portlet.action.test.AddAppBuilderAppMVCResourceCommandTest > testAddAppWorkflow STARTED
         [exec] 
         [exec] com.liferay.app.builder.workflow.web.internal.portlet.action.test.AddAppBuilderAppMVCResourceCommandTest > testAddAppWorkflow PASSED
         [exec] 
         [exec] com.liferay.app.builder.workflow.web.internal.portlet.action.test.AddAppBuilderAppMVCResourceCommandTest > testAddAppWorkflowWithDuplicateTasks STARTED
         [exec] 
         [exec] com.liferay.app.builder.workflow.web.internal.portlet.action.test.AddAppBuilderAppMVCResourceCommandTest > testAddAppWorkflowWithDuplicateTasks PASSED
         [exec] 
         [exec] com.liferay.app.builder.workflow.web.internal.portlet.action.test.UpdateAppBuilderAppMVCResourceCommandTest > testUpdateAppWorkflow STARTED
         [exec] 
         [exec] com.liferay.app.builder.workflow.web.internal.portlet.action.test.UpdateAppBuilderAppMVCResourceCommandTest > testUpdateAppWorkflow FAILED
         [exec]     java.lang.NullPointerException
         [exec]     	at com.liferay.app.builder.workflow.web.internal.portlet.action.test.UpdateAppBuilderAppMVCResourceCommandTest.testUpdateAppWorkflow(UpdateAppBuilderAppMVCResourceCommandTest.java:41)
         [exec]     	at sun.reflect.NativeMethodAccessorImpl.invoke0(Native Method)
         [exec]     	at sun.reflect.NativeMethodAccessorImpl.invoke(NativeMethodAccessorImpl.java:62)
         [exec]     	at sun.reflect.DelegatingMethodAccessorImpl.invoke(DelegatingMethodAccessorImpl.java:43)
         [exec]     	at java.lang.reflect.Method.invoke(Method.java:498)
         [exec]     	at com.liferay.arquillian.extension.junit.bridge.server.TestExecutorRunnable$3.evaluate(TestExecutorRunnable.java:353)
         [exec]     	at org.junit.internal.runners.statements.RunBefores.evaluate(RunBefores.java:26)
         [exec]     	at com.liferay.portal.kernel.test.rule.AbstractTestRule$2.evaluate(AbstractTestRule.java:99)
         [exec]     	at com.liferay.portal.kernel.test.rule.AbstractTestRule$2.evaluate(AbstractTestRule.java:99)
         [exec]     	at com.liferay.portal.kernel.test.rule.AbstractTestRule$2.evaluate(AbstractTestRule.java:99)
         [exec]     	at com.liferay.portal.kernel.test.rule.AbstractTestRule$2.evaluate(AbstractTestRule.java:99)
         [exec]     	at com.liferay.portal.kernel.test.rule.AbstractTestRule$2.evaluate(AbstractTestRule.java:99)
         [exec]     	at com.liferay.portal.kernel.test.rule.AbstractTestRule$2.evaluate(AbstractTestRule.java:99)
         [exec]     	at org.junit.rules.RunRules.evaluate(RunRules.java:20)
         [exec]     	at com.liferay.arquillian.extension.junit.bridge.server.TestExecutorRunnable$1.evaluate(TestExecutorRunnable.java:237)
         [exec]     	at com.liferay.portal.kernel.test.rule.AbstractTestRule$1.evaluate(AbstractTestRule.java:59)
         [exec]     	at com.liferay.portal.kernel.test.rule.AbstractTestRule$1.evaluate(AbstractTestRule.java:59)
         [exec]     	at com.liferay.portal.kernel.test.rule.AbstractTestRule$1.evaluate(AbstractTestRule.java:59)
         [exec]     	at com.liferay.portal.kernel.test.rule.AbstractTestRule$1.evaluate(AbstractTestRule.java:59)
         [exec]     	at com.liferay.portal.kernel.test.rule.AbstractTestRule$1.evaluate(AbstractTestRule.java:59)
         [exec]     	at com.liferay.portal.kernel.test.rule.AbstractTestRule$1.evaluate(AbstractTestRule.java:59)
         [exec]     	at com.liferay.portal.kernel.test.rule.AbstractTestRule$1.evaluate(AbstractTestRule.java:59)
         [exec]     	at com.liferay.portal.kernel.test.rule.AbstractTestRule$1.evaluate(AbstractTestRule.java:59)
         [exec]     	at com.liferay.portal.kernel.test.rule.AbstractTestRule$1.evaluate(AbstractTestRule.java:59)
         [exec]     	at org.junit.rules.RunRules.evaluate(RunRules.java:20)
         [exec]     	at com.liferay.arquillian.extension.junit.bridge.server.TestExecutorRunnable._execute(TestExecutorRunnable.java:316)
         [exec]     	at com.liferay.arquillian.extension.junit.bridge.server.TestExecutorRunnable.run(TestExecutorRunnable.java:95)
         [exec]     	at java.lang.Thread.run(Thread.java:745)
    

      Attachments

        Activity

          People

          Assignee:
          team-workflow Product Team Workflow
          Reporter:
          calvin.vo Calvin Vo
          Participants of an Issue:
          Recent user:
          Tomáš Polešovský
          Engineering Assignee:
          Rafael Praxedes
          Votes:
          0 Vote for this issue
          Watchers:
          0 Start watching this issue

            Dates

            Created:
            Updated:
            Resolved:
            Days since last comment:
            26 weeks, 6 days ago

              Packages

              Version Package
              Master