Uploaded image for project: 'PUBLIC - Liferay Portal Community Edition'
  1. PUBLIC - Liferay Portal Community Edition
  2. LPS-123080

Task :apps:archived:directory-web:compileJSP failed due to cannot find symbol failures

    Details

      Description

      Task :apps:archived:directory-web:compileJSP failed due to cannot find symbol failures

      Testray link

      Console log

           [exec] > Task :apps:archived:directory-web:compileJSP FAILED
           [exec] /opt/dev/projects/github/liferay-portal/modules/apps/archived/directory-web/build/jspc/org/apache/jsp/view_005fusers_jsp.java:729: error: cannot find symbol
           [exec] 				results = UserLocalServiceUtil.search(company.getCompanyId(), searchTerms.getFirstName(), searchTerms.getMiddleName(), searchTerms.getLastName(), searchTerms.getScreenName(), searchTerms.getEmailAddress(), searchTerms.getStatus(), userParams, searchTerms.isAndOperator(), searchContainer.getStart(), searchContainer.getEnd(), searchContainer.getOrderByComparator());
           [exec] 				                                                                                                                                                                                                                                                                                ^
           [exec]   symbol:   variable searchContainer
           [exec]   location: class view_005fusers_jsp
           [exec] /opt/dev/projects/github/liferay-portal/modules/apps/archived/directory-web/build/jspc/org/apache/jsp/view_005fusers_jsp.java:729: error: cannot find symbol
           [exec] 				results = UserLocalServiceUtil.search(company.getCompanyId(), searchTerms.getFirstName(), searchTerms.getMiddleName(), searchTerms.getLastName(), searchTerms.getScreenName(), searchTerms.getEmailAddress(), searchTerms.getStatus(), userParams, searchTerms.isAndOperator(), searchContainer.getStart(), searchContainer.getEnd(), searchContainer.getOrderByComparator());
           [exec] 				                                                                                                                                                                                                                                                                                                            ^
           [exec]   symbol:   variable searchContainer
           [exec]   location: class view_005fusers_jsp
           [exec] /opt/dev/projects/github/liferay-portal/modules/apps/archived/directory-web/build/jspc/org/apache/jsp/view_005fusers_jsp.java:729: error: cannot find symbol
           [exec] 				results = UserLocalServiceUtil.search(company.getCompanyId(), searchTerms.getFirstName(), searchTerms.getMiddleName(), searchTerms.getLastName(), searchTerms.getScreenName(), searchTerms.getEmailAddress(), searchTerms.getStatus(), userParams, searchTerms.isAndOperator(), searchContainer.getStart(), searchContainer.getEnd(), searchContainer.getOrderByComparator());
           [exec] 				                                                                                                                                                                                                                                                                                                                                      ^
           [exec]   symbol:   variable searchContainer
           [exec]   location: class view_005fusers_jsp
           [exec] /opt/dev/projects/github/liferay-portal/modules/apps/archived/directory-web/build/jspc/org/apache/jsp/view_005fusers_jsp.java:734: error: cannot find symbol
           [exec] 				searchContainer.setTotal(total);
           [exec] 				^
           [exec]   symbol:   variable searchContainer
           [exec]   location: class view_005fusers_jsp
           [exec] /opt/dev/projects/github/liferay-portal/modules/apps/archived/directory-web/build/jspc/org/apache/jsp/view_005fusers_jsp.java:736: error: cannot find symbol
           [exec] 				results = UserLocalServiceUtil.search(company.getCompanyId(), searchTerms.getKeywords(), searchTerms.getStatus(), userParams, searchContainer.getStart(), searchContainer.getEnd(), searchContainer.getOrderByComparator());
           [exec] 				                                                                                                                              ^
           [exec]   symbol:   variable searchContainer
           [exec]   location: class view_005fusers_jsp
           [exec] /opt/dev/projects/github/liferay-portal/modules/apps/archived/directory-web/build/jspc/org/apache/jsp/view_005fusers_jsp.java:736: error: cannot find symbol
           [exec] 				results = UserLocalServiceUtil.search(company.getCompanyId(), searchTerms.getKeywords(), searchTerms.getStatus(), userParams, searchContainer.getStart(), searchContainer.getEnd(), searchContainer.getOrderByComparator());
           [exec] 				                                                                                                                                                          ^
           [exec]   symbol:   variable searchContainer
           [exec]   location: class view_005fusers_jsp
           [exec] /opt/dev/projects/github/liferay-portal/modules/apps/archived/directory-web/build/jspc/org/apache/jsp/view_005fusers_jsp.java:736: error: cannot find symbol
           [exec] 				results = UserLocalServiceUtil.search(company.getCompanyId(), searchTerms.getKeywords(), searchTerms.getStatus(), userParams, searchContainer.getStart(), searchContainer.getEnd(), searchContainer.getOrderByComparator());
           [exec] 				                                                                                                                                                                                    ^
           [exec]   symbol:   variable searchContainer
           [exec]   location: class view_005fusers_jsp
           [exec] /opt/dev/projects/github/liferay-portal/modules/apps/archived/directory-web/build/jspc/org/apache/jsp/view_005fusers_jsp.java:739: error: cannot find symbol
           [exec] 			searchContainer.setTotal(total);
           [exec] 			^
           [exec]   symbol:   variable searchContainer
           [exec]   location: class view_005fusers_jsp
           [exec] /opt/dev/projects/github/liferay-portal/modules/apps/archived/directory-web/build/jspc/org/apache/jsp/view_005fusers_jsp.java:740: error: cannot find symbol
           [exec] 			searchContainer.setResults(results);
           [exec] 			^
           [exec]   symbol:   variable searchContainer
           [exec]   location: class view_005fusers_jsp
           [exec] Note: Some input files use or override a deprecated API.
           [exec] Note: Recompile with -Xlint:deprecation for details.
           [exec] Note: Some input files use unchecked or unsafe operations.
           [exec] Note: Recompile with -Xlint:unchecked for details.
           [exec] 9 errors
           [exec] Gradle build finished at 2020-11-04 02:57:10.972.
           [exec] 
           [exec] 365 actionable tasks: 365 executed
           [exec] 
           [exec] FAILURE: Build failed with an exception.
           [exec] 
           [exec] * What went wrong:
           [exec] Execution failed for task ':apps:archived:directory-web:compileJSP'.
           [exec] > Compilation failed; see the compiler error output for details.
           [exec] 
           [exec] * Try:
           [exec] Run with --info or --debug option to get more log output. Run with --scan to get full insights.
           [exec] 
           [exec] * Exception is:
           [exec] org.gradle.api.tasks.TaskExecutionException: Execution failed for task ':apps:archived:directory-web:compileJSP'.
           [exec] 	at org.gradle.api.internal.tasks.execution.ExecuteActionsTaskExecuter.lambda$executeIfValid$1(ExecuteActionsTaskExecuter.java:208)
           [exec] 	at org.gradle.internal.Try$Failure.ifSuccessfulOrElse(Try.java:263)
           [exec] 	at org.gradle.api.internal.tasks.execution.ExecuteActionsTaskExecuter.executeIfValid(ExecuteActionsTaskExecuter.java:206)
           [exec] 	at org.gradle.api.internal.tasks.execution.ExecuteActionsTaskExecuter.execute(ExecuteActionsTaskExecuter.java:187)
           [exec] 	at org.gradle.api.internal.tasks.execution.CleanupStaleOutputsExecuter.execute(CleanupStaleOutputsExecuter.java:114)
           [exec] 	at org.gradle.api.internal.tasks.execution.FinalizePropertiesTaskExecuter.execute(FinalizePropertiesTaskExecuter.java:46)
           [exec] 	at org.gradle.api.internal.tasks.execution.ResolveTaskExecutionModeExecuter.execute(ResolveTaskExecutionModeExecuter.java:62)
           [exec] 	at org.gradle.api.internal.tasks.execution.SkipTaskWithNoActionsExecuter.execute(SkipTaskWithNoActionsExecuter.java:57)
           [exec] 	at org.gradle.api.internal.tasks.execution.SkipOnlyIfTaskExecuter.execute(SkipOnlyIfTaskExecuter.java:56)
           [exec] 	at org.gradle.api.internal.tasks.execution.CatchExceptionTaskExecuter.execute(CatchExceptionTaskExecuter.java:36)
           [exec] 	at org.gradle.api.internal.tasks.execution.EventFiringTaskExecuter$1.executeTask(EventFiringTaskExecuter.java:77)
           [exec] 	at org.gradle.api.internal.tasks.execution.EventFiringTaskExecuter$1.call(EventFiringTaskExecuter.java:55)
           [exec] 	at org.gradle.api.internal.tasks.execution.EventFiringTaskExecuter$1.call(EventFiringTaskExecuter.java:52)
           [exec] 	at org.gradle.internal.operations.DefaultBuildOperationExecutor$CallableBuildOperationWorker.execute(DefaultBuildOperationExecutor.java:409)
           [exec] 	at org.gradle.internal.operations.DefaultBuildOperationExecutor$CallableBuildOperationWorker.execute(DefaultBuildOperationExecutor.java:399)
           [exec] 	at org.gradle.internal.operations.DefaultBuildOperationExecutor$1.execute(DefaultBuildOperationExecutor.java:157)
           [exec] 	at org.gradle.internal.operations.DefaultBuildOperationExecutor.execute(DefaultBuildOperationExecutor.java:242)
           [exec] 	at org.gradle.internal.operations.DefaultBuildOperationExecutor.execute(DefaultBuildOperationExecutor.java:150)
           [exec] 	at org.gradle.internal.operations.DefaultBuildOperationExecutor.call(DefaultBuildOperationExecutor.java:94)
           [exec] 	at org.gradle.internal.operations.DelegatingBuildOperationExecutor.call(DelegatingBuildOperationExecutor.java:36)
           [exec] 	at org.gradle.api.internal.tasks.execution.EventFiringTaskExecuter.execute(EventFiringTaskExecuter.java:52)
           [exec] 	at org.gradle.execution.plan.LocalTaskNodeExecutor.execute(LocalTaskNodeExecutor.java:41)
           [exec] 	at org.gradle.execution.taskgraph.DefaultTaskExecutionGraph$InvokeNodeExecutorsAction.execute(DefaultTaskExecutionGraph.java:372)
           [exec] 	at org.gradle.execution.taskgraph.DefaultTaskExecutionGraph$InvokeNodeExecutorsAction.execute(DefaultTaskExecutionGraph.java:359)
           [exec] 	at org.gradle.execution.taskgraph.DefaultTaskExecutionGraph$BuildOperationAwareExecutionAction.execute(DefaultTaskExecutionGraph.java:352)
           [exec] 	at org.gradle.execution.taskgraph.DefaultTaskExecutionGraph$BuildOperationAwareExecutionAction.execute(DefaultTaskExecutionGraph.java:338)
           [exec] 	at org.gradle.execution.plan.DefaultPlanExecutor$ExecutorWorker.lambda$run$0(DefaultPlanExecutor.java:127)
           [exec] 	at org.gradle.execution.plan.DefaultPlanExecutor$ExecutorWorker.execute(DefaultPlanExecutor.java:191)
           [exec] 	at org.gradle.execution.plan.DefaultPlanExecutor$ExecutorWorker.executeNextNode(DefaultPlanExecutor.java:182)
           [exec] 	at org.gradle.execution.plan.DefaultPlanExecutor$ExecutorWorker.run(DefaultPlanExecutor.java:124)
           [exec] 	at org.gradle.internal.concurrent.ExecutorPolicy$CatchAndRecordFailures.onExecute(ExecutorPolicy.java:64)
           [exec] 	at org.gradle.internal.concurrent.ManagedExecutorImpl$1.run(ManagedExecutorImpl.java:48)
           [exec] 	at org.gradle.internal.concurrent.ThreadFactoryImpl$ManagedThreadRunnable.run(ThreadFactoryImpl.java:56)
           [exec] Caused by: org.gradle.api.internal.tasks.compile.CompilationFailedException: Compilation failed; see the compiler error output for details.
           [exec] 	at org.gradle.api.internal.tasks.compile.JdkJavaCompiler.execute(JdkJavaCompiler.java:57)
           [exec] 	at org.gradle.api.internal.tasks.compile.JdkJavaCompiler.execute(JdkJavaCompiler.java:40)
           [exec] 	at org.gradle.api.internal.tasks.compile.daemon.AbstractDaemonCompiler$CompilerWorkAction.execute(AbstractDaemonCompiler.java:135)
           [exec] 	at org.gradle.workers.internal.DefaultWorkerServer.execute(DefaultWorkerServer.java:63)
           [exec] 	at org.gradle.workers.internal.AbstractClassLoaderWorker$1.create(AbstractClassLoaderWorker.java:49)
           [exec] 	at org.gradle.workers.internal.AbstractClassLoaderWorker$1.create(AbstractClassLoaderWorker.java:43)
           [exec] 	at org.gradle.internal.classloader.ClassLoaderUtils.executeInClassloader(ClassLoaderUtils.java:97)
           [exec] 	at org.gradle.workers.internal.AbstractClassLoaderWorker.executeInClassLoader(AbstractClassLoaderWorker.java:43)
           [exec] 	at org.gradle.workers.internal.FlatClassLoaderWorker.run(FlatClassLoaderWorker.java:32)
           [exec] 	at org.gradle.workers.internal.FlatClassLoaderWorker.run(FlatClassLoaderWorker.java:22)
           [exec] 	at org.gradle.workers.internal.WorkerDaemonServer.run(WorkerDaemonServer.java:85)
           [exec] 	at org.gradle.workers.internal.WorkerDaemonServer.run(WorkerDaemonServer.java:55)
           [exec] 	at org.gradle.process.internal.worker.request.WorkerAction$1.call(WorkerAction.java:138)
           [exec] 	at org.gradle.process.internal.worker.child.WorkerLogEventListener.withWorkerLoggingProtocol(WorkerLogEventListener.java:41)
           [exec] 	at org.gradle.process.internal.worker.request.WorkerAction.run(WorkerAction.java:135)
           [exec] 	at org.gradle.internal.dispatch.ReflectionDispatch.dispatch(ReflectionDispatch.java:36)
           [exec] 	at org.gradle.internal.dispatch.ReflectionDispatch.dispatch(ReflectionDispatch.java:24)
           [exec] 	at org.gradle.internal.remote.internal.hub.MessageHubBackedObjectConnection$DispatchWrapper.dispatch(MessageHubBackedObjectConnection.java:182)
           [exec] 	at org.gradle.internal.remote.internal.hub.MessageHubBackedObjectConnection$DispatchWrapper.dispatch(MessageHubBackedObjectConnection.java:164)
           [exec] 	at org.gradle.internal.remote.internal.hub.MessageHub$Handler.run(MessageHub.java:414)
           [exec] 	at org.gradle.internal.concurrent.ExecutorPolicy$CatchAndRecordFailures.onExecute(ExecutorPolicy.java:64)
           [exec] 	at org.gradle.internal.concurrent.ManagedExecutorImpl$1.run(ManagedExecutorImpl.java:48)
           [exec] 	at org.gradle.internal.concurrent.ThreadFactoryImpl$ManagedThreadRunnable.run(ThreadFactoryImpl.java:56)
           [exec] 
           [exec] 
           [exec] * Get more help at https://help.gradle.org
           [exec] 
           [exec] BUILD FAILED in 8m 49s
      

        Attachments

          Activity

            People

            Assignee:
            yvonne.han Yvonne Han
            Reporter:
            yvonne.han Yvonne Han
            Participants of an Issue:
            Recent user:
            Sophia Zhang
            Engineering Assignee:
            Adolfo PĂ©rez
            Votes:
            0 Vote for this issue
            Watchers:
            2 Start watching this issue

              Dates

              Created:
              Updated:
              Resolved:
              Days since last comment:
              1 year, 8 weeks, 4 days ago

                Packages

                Version Package
                7.4.13 DXP GA1
                Master