Uploaded image for project: 'PUBLIC - Liferay Portal Community Edition'
  1. PUBLIC - Liferay Portal Community Edition
  2. LPS-131616

Investigate failure in modules-compile-jdk8/0/0

    Details

      Description

      Testray

      Jenkins

      [exec] FAILURE: Build failed with an exception.
           [exec] 
           [exec] * What went wrong:
           [exec] Execution failed for task ':apps:calendar:calendar-test-util:javadoc'.
           [exec] > Javadoc generation failed. Generated Javadoc options file (useful for troubleshooting): '/opt/dev/projects/github/liferay-portal/modules/apps/calendar/calendar-test-util/build/tmp/javadoc/javadoc.options'
           [exec] 
           [exec] * Try:
           [exec] Run with --info or --debug option to get more log output. Run with --scan to get full insights.
           [exec] 
           [exec] * Exception is:
           [exec] org.gradle.api.tasks.TaskExecutionException: Execution failed for task ':apps:calendar:calendar-test-util:javadoc'.
           [exec] 	at org.gradle.api.internal.tasks.execution.ExecuteActionsTaskExecuter.lambda$executeIfValid$1(ExecuteActionsTaskExecuter.java:208)
           [exec] 	at org.gradle.internal.Try$Failure.ifSuccessfulOrElse(Try.java:263)
           [exec] 	at org.gradle.api.internal.tasks.execution.ExecuteActionsTaskExecuter.executeIfValid(ExecuteActionsTaskExecuter.java:206)
           [exec] 	at org.gradle.api.internal.tasks.execution.ExecuteActionsTaskExecuter.execute(ExecuteActionsTaskExecuter.java:187)
           [exec] 	at org.gradle.api.internal.tasks.execution.CleanupStaleOutputsExecuter.execute(CleanupStaleOutputsExecuter.java:114)
           [exec] 	at org.gradle.api.internal.tasks.execution.FinalizePropertiesTaskExecuter.execute(FinalizePropertiesTaskExecuter.java:46)
           [exec] 	at org.gradle.api.internal.tasks.execution.ResolveTaskExecutionModeExecuter.execute(ResolveTaskExecutionModeExecuter.java:62)
           [exec] 	at org.gradle.api.internal.tasks.execution.SkipTaskWithNoActionsExecuter.execute(SkipTaskWithNoActionsExecuter.java:57)
           [exec] 	at org.gradle.api.internal.tasks.execution.SkipOnlyIfTaskExecuter.execute(SkipOnlyIfTaskExecuter.java:56)
           [exec] 	at org.gradle.api.internal.tasks.execution.CatchExceptionTaskExecuter.execute(CatchExceptionTaskExecuter.java:36)
           [exec] 	at org.gradle.api.internal.tasks.execution.EventFiringTaskExecuter$1.executeTask(EventFiringTaskExecuter.java:77)
           [exec] 	at org.gradle.api.internal.tasks.execution.EventFiringTaskExecuter$1.call(EventFiringTaskExecuter.java:55)
           [exec] 	at org.gradle.api.internal.tasks.execution.EventFiringTaskExecuter$1.call(EventFiringTaskExecuter.java:52)
           [exec] 	at org.gradle.internal.operations.DefaultBuildOperationExecutor$CallableBuildOperationWorker.execute(DefaultBuildOperationExecutor.java:409)
           [exec] 	at org.gradle.internal.operations.DefaultBuildOperationExecutor$CallableBuildOperationWorker.execute(DefaultBuildOperationExecutor.java:399)
           [exec] 	at org.gradle.internal.operations.DefaultBuildOperationExecutor$1.execute(DefaultBuildOperationExecutor.java:157)
           [exec] 	at org.gradle.internal.operations.DefaultBuildOperationExecutor.execute(DefaultBuildOperationExecutor.java:242)
           [exec] 	at org.gradle.internal.operations.DefaultBuildOperationExecutor.execute(DefaultBuildOperationExecutor.java:150)
           [exec] 	at org.gradle.internal.operations.DefaultBuildOperationExecutor.call(DefaultBuildOperationExecutor.java:94)
           [exec] 	at org.gradle.internal.operations.DelegatingBuildOperationExecutor.call(DelegatingBuildOperationExecutor.java:36)
           [exec] 	at org.gradle.api.internal.tasks.execution.EventFiringTaskExecuter.execute(EventFiringTaskExecuter.java:52)
           [exec] 	at org.gradle.execution.plan.LocalTaskNodeExecutor.execute(LocalTaskNodeExecutor.java:41)
           [exec] 	at org.gradle.execution.taskgraph.DefaultTaskExecutionGraph$InvokeNodeExecutorsAction.execute(DefaultTaskExecutionGraph.java:372)
           [exec] 	at org.gradle.execution.taskgraph.DefaultTaskExecutionGraph$InvokeNodeExecutorsAction.execute(DefaultTaskExecutionGraph.java:359)
           [exec] 	at org.gradle.execution.taskgraph.DefaultTaskExecutionGraph$BuildOperationAwareExecutionAction.execute(DefaultTaskExecutionGraph.java:352)
           [exec] 	at org.gradle.execution.taskgraph.DefaultTaskExecutionGraph$BuildOperationAwareExecutionAction.execute(DefaultTaskExecutionGraph.java:338)
           [exec] 	at org.gradle.execution.plan.DefaultPlanExecutor$ExecutorWorker.lambda$run$0(DefaultPlanExecutor.java:127)
           [exec] 	at org.gradle.execution.plan.DefaultPlanExecutor$ExecutorWorker.execute(DefaultPlanExecutor.java:191)
           [exec] 	at org.gradle.execution.plan.DefaultPlanExecutor$ExecutorWorker.executeNextNode(DefaultPlanExecutor.java:182)
           [exec] 	at org.gradle.execution.plan.DefaultPlanExecutor$ExecutorWorker.run(DefaultPlanExecutor.java:124)
           [exec] 	at org.gradle.internal.concurrent.ExecutorPolicy$CatchAndRecordFailures.onExecute(ExecutorPolicy.java:64)
           [exec] 	at org.gradle.internal.concurrent.ManagedExecutorImpl$1.run(ManagedExecutorImpl.java:48)
           [exec] 	at org.gradle.internal.concurrent.ThreadFactoryImpl$ManagedThreadRunnable.run(ThreadFactoryImpl.java:56)
           [exec] Caused by: org.gradle.api.GradleException: Javadoc generation failed. Generated Javadoc options file (useful for troubleshooting): '/opt/dev/projects/github/liferay-portal/modules/apps/calendar/calendar-test-util/build/tmp/javadoc/javadoc.options'
      

        Attachments

          Activity

            People

            Assignee:
            brian.lee Brian Lee
            Reporter:
            brittney.nguyen Brittney Nguyen
            Participants of an Issue:
            Recent user:
            Rafaela Nascimento
            Engineering Assignee:
            André Ricardo Barreto de Oliveira
            Votes:
            0 Vote for this issue
            Watchers:
            0 Start watching this issue

              Dates

              Created:
              Updated:
              Resolved:
              Days since last comment:
              17 weeks ago

                Packages

                Version Package
                7.4.1 CE GA2 DXP 7,4
                Master