Uploaded image for project: 'PUBLIC - Liferay Portal Community Edition'
  1. PUBLIC - Liferay Portal Community Edition
  2. LPS-132755

modules-integration issue: ArchivedModulesUpgradeTest

    Details

      Description

      test-portal-acceptance-upstream-dxp-batch(7.1.x)/modules-integration-mysql57-jdk8/0
      Issue:

           [exec] com.liferay.archived.modules.upgrade.test.ArchivedModulesUpgradeTest > testDeprecatedModulesUpgradeChat STARTED
           [exec] 
           [exec] com.liferay.archived.modules.upgrade.test.ArchivedModulesUpgradeTest > testDeprecatedModulesUpgradeChat FAILED
           [exec]     java.lang.AssertionError: expected null, but was:<{mvccVersion=0, releaseId=77859, createDate=Mon May 24 18:55:08 GMT 2021, modifiedDate=Mon May 24 18:55:08 GMT 2021, servletContextName=com.liferay.chat.service, schemaVersion=0.0.0, buildNumber=0, buildDate=null, verified=false, state=0, testString=}>
           [exec]     	at org.junit.Assert.fail(Assert.java:88)
           [exec]     	at org.junit.Assert.failNotNull(Assert.java:755)
           [exec]     	at org.junit.Assert.assertNull(Assert.java:737)
           [exec]     	at org.junit.Assert.assertNull(Assert.java:747)
           [exec]     	at com.liferay.archived.modules.upgrade.test.ArchivedModulesUpgradeTest._testDeprecatedModulesUpgrade(ArchivedModulesUpgradeTest.java:175)
           [exec]     	at com.liferay.archived.modules.upgrade.test.ArchivedModulesUpgradeTest.testDeprecatedModulesUpgradeChat(ArchivedModulesUpgradeTest.java:81)
           [exec]     	at sun.reflect.NativeMethodAccessorImpl.invoke0(Native Method)
           [exec]     	at sun.reflect.NativeMethodAccessorImpl.invoke(NativeMethodAccessorImpl.java:62)
           [exec]     	at sun.reflect.DelegatingMethodAccessorImpl.invoke(DelegatingMethodAccessorImpl.java:43)
           [exec]     	at java.lang.reflect.Method.invoke(Method.java:498)
           [exec]     	at com.liferay.arquillian.extension.junit.bridge.server.TestExecutorRunnable$2.evaluate(TestExecutorRunnable.java:234)
           [exec]     	at org.junit.internal.runners.statements.RunBefores.evaluate(RunBefores.java:26)
           [exec]     	at org.junit.internal.runners.statements.RunAfters.evaluate(RunAfters.java:27)
           [exec]     	at com.liferay.portal.kernel.test.rule.BaseTestRule$1.evaluate(BaseTestRule.java:55)
           [exec]     	at com.liferay.portal.kernel.test.rule.BaseTestRule$1.evaluate(BaseTestRule.java:55)
           [exec]     	at com.liferay.portal.kernel.test.rule.BaseTestRule$1.evaluate(BaseTestRule.java:55)
           [exec]     	at com.liferay.portal.kernel.test.rule.BaseTestRule$1.evaluate(BaseTestRule.java:55)
           [exec]     	at com.liferay.portal.kernel.test.rule.BaseTestRule$1.evaluate(BaseTestRule.java:55)
           [exec]     	at com.liferay.portal.kernel.test.rule.BaseTestRule$1.evaluate(BaseTestRule.java:55)
           [exec]     	at com.liferay.portal.kernel.test.rule.BaseTestRule$1.evaluate(BaseTestRule.java:55)
           [exec]     	at com.liferay.portal.kernel.test.rule.BaseTestRule$1.evaluate(BaseTestRule.java:55)
           [exec]     	at com.liferay.portal.kernel.test.rule.BaseTestRule$1.evaluate(BaseTestRule.java:55)
           [exec]     	at com.liferay.portal.test.rule.LiferayIntegrationTestRule$1$1.evaluate(LiferayIntegrationTestRule.java:154)
           [exec]     	at com.liferay.portal.kernel.test.rule.BaseTestRule$1.evaluate(BaseTestRule.java:55)
           [exec]     	at com.liferay.portal.kernel.test.rule.TimeoutTestRule$1.evaluate(TimeoutTestRule.java:89)
           [exec]     	at org.junit.rules.RunRules.evaluate(RunRules.java:20)
           [exec]     	at com.liferay.arquillian.extension.junit.bridge.server.TestExecutorRunnable$1.evaluate(TestExecutorRunnable.java:143)
           [exec]     	at com.liferay.portal.kernel.test.rule.BaseTestRule$2.evaluate(BaseTestRule.java:72)
           [exec]     	at com.liferay.portal.kernel.test.rule.BaseTestRule$2.evaluate(BaseTestRule.java:72)
           [exec]     	at com.liferay.portal.kernel.test.rule.BaseTestRule$2.evaluate(BaseTestRule.java:72)
           [exec]     	at com.liferay.portal.kernel.test.rule.BaseTestRule$2.evaluate(BaseTestRule.java:72)
           [exec]     	at com.liferay.portal.kernel.test.rule.BaseTestRule$2.evaluate(BaseTestRule.java:72)
           [exec]     	at com.liferay.portal.kernel.test.rule.BaseTestRule$2.evaluate(BaseTestRule.java:72)
           [exec]     	at com.liferay.portal.kernel.test.rule.BaseTestRule$2.evaluate(BaseTestRule.java:72)
           [exec]     	at com.liferay.portal.kernel.test.rule.BaseTestRule$2.evaluate(BaseTestRule.java:72)
           [exec]     	at com.liferay.portal.kernel.test.rule.BaseTestRule$2.evaluate(BaseTestRule.java:72)
           [exec]     	at com.liferay.portal.test.rule.LiferayIntegrationTestRule$1$1.evaluate(LiferayIntegrationTestRule.java:154)
           [exec]     	at com.liferay.portal.kernel.test.rule.BaseTestRule$2.evaluate(BaseTestRule.java:72)
           [exec]     	at org.junit.rules.RunRules.evaluate(RunRules.java:20)
           [exec]     	at com.liferay.arquillian.extension.junit.bridge.server.TestExecutorRunnable._execute(TestExecutorRunnable.java:181)
           [exec]     	at com.liferay.arquillian.extension.junit.bridge.server.TestExecutorRunnable.run(TestExecutorRunnable.java:95)
           [exec]     	at java.lang.Thread.run(Thread.java:745)
           [exec] 
           [exec] com.liferay.archived.modules.upgrade.test.ArchivedModulesUpgradeTest > testDeprecatedModulesUpgradeMailReader STARTED
           [exec] 
           [exec] com.liferay.archived.modules.upgrade.test.ArchivedModulesUpgradeTest > testDeprecatedModulesUpgradeMailReader FAILED
           [exec]     java.lang.AssertionError: expected null, but was:<{mvccVersion=0, releaseId=77865, createDate=Mon May 24 18:55:08 GMT 2021, modifiedDate=Mon May 24 18:55:08 GMT 2021, servletContextName=com.liferay.mail.reader.service, schemaVersion=0.0.0, buildNumber=0, buildDate=null, verified=false, state=0, testString=}>
           [exec]     	at org.junit.Assert.fail(Assert.java:88)
           [exec]     	at org.junit.Assert.failNotNull(Assert.java:755)
           [exec]     	at org.junit.Assert.assertNull(Assert.java:737)
           [exec]     	at org.junit.Assert.assertNull(Assert.java:747)
           [exec]     	at com.liferay.archived.modules.upgrade.test.ArchivedModulesUpgradeTest._testDeprecatedModulesUpgrade(ArchivedModulesUpgradeTest.java:175)
           [exec]     	at com.liferay.archived.modules.upgrade.test.ArchivedModulesUpgradeTest.testDeprecatedModulesUpgradeMailReader(ArchivedModulesUpgradeTest.java:88)
           [exec]     	at sun.reflect.NativeMethodAccessorImpl.invoke0(Native Method)
           [exec]     	at sun.reflect.NativeMethodAccessorImpl.invoke(NativeMethodAccessorImpl.java:62)
           [exec]     	at sun.reflect.DelegatingMethodAccessorImpl.invoke(DelegatingMethodAccessorImpl.java:43)
           [exec]     	at java.lang.reflect.Method.invoke(Method.java:498)
           [exec]     	at com.liferay.arquillian.extension.junit.bridge.server.TestExecutorRunnable$2.evaluate(TestExecutorRunnable.java:234)
           [exec]     	at org.junit.internal.runners.statements.RunBefores.evaluate(RunBefores.java:26)
           [exec]     	at org.junit.internal.runners.statements.RunAfters.evaluate(RunAfters.java:27)
           [exec]     	at com.liferay.portal.kernel.test.rule.BaseTestRule$1.evaluate(BaseTestRule.java:55)
           [exec]     	at com.liferay.portal.kernel.test.rule.BaseTestRule$1.evaluate(BaseTestRule.java:55)
           [exec]     	at com.liferay.portal.kernel.test.rule.BaseTestRule$1.evaluate(BaseTestRule.java:55)
           [exec]     	at com.liferay.portal.kernel.test.rule.BaseTestRule$1.evaluate(BaseTestRule.java:55)
           [exec]     	at com.liferay.portal.kernel.test.rule.BaseTestRule$1.evaluate(BaseTestRule.java:55)
           [exec]     	at com.liferay.portal.kernel.test.rule.BaseTestRule$1.evaluate(BaseTestRule.java:55)
           [exec]     	at com.liferay.portal.kernel.test.rule.BaseTestRule$1.evaluate(BaseTestRule.java:55)
           [exec]     	at com.liferay.portal.kernel.test.rule.BaseTestRule$1.evaluate(BaseTestRule.java:55)
           [exec]     	at com.liferay.portal.kernel.test.rule.BaseTestRule$1.evaluate(BaseTestRule.java:55)
           [exec]     	at com.liferay.portal.test.rule.LiferayIntegrationTestRule$1$1.evaluate(LiferayIntegrationTestRule.java:154)
           [exec]     	at com.liferay.portal.kernel.test.rule.BaseTestRule$1.evaluate(BaseTestRule.java:55)
           [exec]     	at com.liferay.portal.kernel.test.rule.TimeoutTestRule$1.evaluate(TimeoutTestRule.java:89)
           [exec]     	at org.junit.rules.RunRules.evaluate(RunRules.java:20)
           [exec]     	at com.liferay.arquillian.extension.junit.bridge.server.TestExecutorRunnable$1.evaluate(TestExecutorRunnable.java:143)
           [exec]     	at com.liferay.portal.kernel.test.rule.BaseTestRule$2.evaluate(BaseTestRule.java:72)
           [exec]     	at com.liferay.portal.kernel.test.rule.BaseTestRule$2.evaluate(BaseTestRule.java:72)
           [exec]     	at com.liferay.portal.kernel.test.rule.BaseTestRule$2.evaluate(BaseTestRule.java:72)
           [exec]     	at com.liferay.portal.kernel.test.rule.BaseTestRule$2.evaluate(BaseTestRule.java:72)
           [exec]     	at com.liferay.portal.kernel.test.rule.BaseTestRule$2.evaluate(BaseTestRule.java:72)
           [exec]     	at com.liferay.portal.kernel.test.rule.BaseTestRule$2.evaluate(BaseTestRule.java:72)
           [exec]     	at com.liferay.portal.kernel.test.rule.BaseTestRule$2.evaluate(BaseTestRule.java:72)
           [exec]     	at com.liferay.portal.kernel.test.rule.BaseTestRule$2.evaluate(BaseTestRule.java:72)
           [exec]     	at com.liferay.portal.kernel.test.rule.BaseTestRule$2.evaluate(BaseTestRule.java:72)
           [exec]     	at com.liferay.portal.test.rule.LiferayIntegrationTestRule$1$1.evaluate(LiferayIntegrationTestRule.java:154)
           [exec]     	at com.liferay.portal.kernel.test.rule.BaseTestRule$2.evaluate(BaseTestRule.java:72)
           [exec]     	at org.junit.rules.RunRules.evaluate(RunRules.java:20)
           [exec]     	at com.liferay.arquillian.extension.junit.bridge.server.TestExecutorRunnable._execute(TestExecutorRunnable.java:181)
           [exec]     	at com.liferay.arquillian.extension.junit.bridge.server.TestExecutorRunnable.run(TestExecutorRunnable.java:95)
           [exec]     	at java.lang.Thread.run(Thread.java:745)
           [exec] 
           [exec] com.liferay.archived.modules.upgrade.test.ArchivedModulesUpgradeTest > testDeprecatedModulesUpgradePrivateMessaging STARTED
           [exec] 
           [exec] com.liferay.archived.modules.upgrade.test.ArchivedModulesUpgradeTest > testDeprecatedModulesUpgradePrivateMessaging FAILED
           [exec]     java.lang.AssertionError: expected null, but was:<{mvccVersion=0, releaseId=77878, createDate=Mon May 24 18:55:09 GMT 2021, modifiedDate=Mon May 24 18:55:09 GMT 2021, servletContextName=com.liferay.social.privatemessaging.service, schemaVersion=0.0.0, buildNumber=0, buildDate=null, verified=false, state=0, testString=}>
           [exec]     	at org.junit.Assert.fail(Assert.java:88)
           [exec]     	at org.junit.Assert.failNotNull(Assert.java:755)
           [exec]     	at org.junit.Assert.assertNull(Assert.java:737)
           [exec]     	at org.junit.Assert.assertNull(Assert.java:747)
           [exec]     	at com.liferay.archived.modules.upgrade.test.ArchivedModulesUpgradeTest._testDeprecatedModulesUpgrade(ArchivedModulesUpgradeTest.java:175)
           [exec]     	at com.liferay.archived.modules.upgrade.test.ArchivedModulesUpgradeTest.testDeprecatedModulesUpgradePrivateMessaging(ArchivedModulesUpgradeTest.java:98)
           [exec]     	at sun.reflect.NativeMethodAccessorImpl.invoke0(Native Method)
           [exec]     	at sun.reflect.NativeMethodAccessorImpl.invoke(NativeMethodAccessorImpl.java:62)
           [exec]     	at sun.reflect.DelegatingMethodAccessorImpl.invoke(DelegatingMethodAccessorImpl.java:43)
           [exec]     	at java.lang.reflect.Method.invoke(Method.java:498)
           [exec]     	at com.liferay.arquillian.extension.junit.bridge.server.TestExecutorRunnable$2.evaluate(TestExecutorRunnable.java:234)
           [exec]     	at org.junit.internal.runners.statements.RunBefores.evaluate(RunBefores.java:26)
           [exec]     	at org.junit.internal.runners.statements.RunAfters.evaluate(RunAfters.java:27)
           [exec]     	at com.liferay.portal.kernel.test.rule.BaseTestRule$1.evaluate(BaseTestRule.java:55)
           [exec]     	at com.liferay.portal.kernel.test.rule.BaseTestRule$1.evaluate(BaseTestRule.java:55)
           [exec]     	at com.liferay.portal.kernel.test.rule.BaseTestRule$1.evaluate(BaseTestRule.java:55)
           [exec]     	at com.liferay.portal.kernel.test.rule.BaseTestRule$1.evaluate(BaseTestRule.java:55)
           [exec]     	at com.liferay.portal.kernel.test.rule.BaseTestRule$1.evaluate(BaseTestRule.java:55)
           [exec]     	at com.liferay.portal.kernel.test.rule.BaseTestRule$1.evaluate(BaseTestRule.java:55)
           [exec]     	at com.liferay.portal.kernel.test.rule.BaseTestRule$1.evaluate(BaseTestRule.java:55)
           [exec]     	at com.liferay.portal.kernel.test.rule.BaseTestRule$1.evaluate(BaseTestRule.java:55)
           [exec]     	at com.liferay.portal.kernel.test.rule.BaseTestRule$1.evaluate(BaseTestRule.java:55)
           [exec]     	at com.liferay.portal.test.rule.LiferayIntegrationTestRule$1$1.evaluate(LiferayIntegrationTestRule.java:154)
           [exec]     	at com.liferay.portal.kernel.test.rule.BaseTestRule$1.evaluate(BaseTestRule.java:55)
           [exec]     	at com.liferay.portal.kernel.test.rule.TimeoutTestRule$1.evaluate(TimeoutTestRule.java:89)
           [exec]     	at org.junit.rules.RunRules.evaluate(RunRules.java:20)
           [exec]     	at com.liferay.arquillian.extension.junit.bridge.server.TestExecutorRunnable$1.evaluate(TestExecutorRunnable.java:143)
           [exec]     	at com.liferay.portal.kernel.test.rule.BaseTestRule$2.evaluate(BaseTestRule.java:72)
           [exec]     	at com.liferay.portal.kernel.test.rule.BaseTestRule$2.evaluate(BaseTestRule.java:72)
           [exec]     	at com.liferay.portal.kernel.test.rule.BaseTestRule$2.evaluate(BaseTestRule.java:72)
           [exec]     	at com.liferay.portal.kernel.test.rule.BaseTestRule$2.evaluate(BaseTestRule.java:72)
           [exec]     	at com.liferay.portal.kernel.test.rule.BaseTestRule$2.evaluate(BaseTestRule.java:72)
           [exec]     	at com.liferay.portal.kernel.test.rule.BaseTestRule$2.evaluate(BaseTestRule.java:72)
           [exec]     	at com.liferay.portal.kernel.test.rule.BaseTestRule$2.evaluate(BaseTestRule.java:72)
           [exec]     	at com.liferay.portal.kernel.test.rule.BaseTestRule$2.evaluate(BaseTestRule.java:72)
           [exec]     	at com.liferay.portal.kernel.test.rule.BaseTestRule$2.evaluate(BaseTestRule.java:72)
           [exec]     	at com.liferay.portal.test.rule.LiferayIntegrationTestRule$1$1.evaluate(LiferayIntegrationTestRule.java:154)
           [exec]     	at com.liferay.portal.kernel.test.rule.BaseTestRule$2.evaluate(BaseTestRule.java:72)
           [exec]     	at org.junit.rules.RunRules.evaluate(RunRules.java:20)
           [exec]     	at com.liferay.arquillian.extension.junit.bridge.server.TestExecutorRunnable._execute(TestExecutorRunnable.java:181)
           [exec]     	at com.liferay.arquillian.extension.junit.bridge.server.TestExecutorRunnable.run(TestExecutorRunnable.java:95)
           [exec]     	at java.lang.Thread.run(Thread.java:745)
           [exec] 
           [exec] com.liferay.archived.modules.upgrade.test.ArchivedModulesUpgradeTest > testDeprecatedModulesUpgradeShopping STARTED
           [exec] 
           [exec] com.liferay.archived.modules.upgrade.test.ArchivedModulesUpgradeTest > testDeprecatedModulesUpgradeShopping FAILED
           [exec]     java.lang.AssertionError: expected null, but was:<{mvccVersion=0, releaseId=77888, createDate=Mon May 24 18:55:09 GMT 2021, modifiedDate=Mon May 24 18:55:09 GMT 2021, servletContextName=com.liferay.shopping.service, schemaVersion=0.0.0, buildNumber=0, buildDate=null, verified=false, state=0, testString=}>
           [exec]     	at org.junit.Assert.fail(Assert.java:88)
           [exec]     	at org.junit.Assert.failNotNull(Assert.java:755)
           [exec]     	at org.junit.Assert.assertNull(Assert.java:737)
           [exec]     	at org.junit.Assert.assertNull(Assert.java:747)
           [exec]     	at com.liferay.archived.modules.upgrade.test.ArchivedModulesUpgradeTest._testDeprecatedModulesUpgrade(ArchivedModulesUpgradeTest.java:175)
           [exec]     	at com.liferay.archived.modules.upgrade.test.ArchivedModulesUpgradeTest.testDeprecatedModulesUpgradeShopping(ArchivedModulesUpgradeTest.java:108)
           [exec]     	at sun.reflect.NativeMethodAccessorImpl.invoke0(Native Method)
           [exec]     	at sun.reflect.NativeMethodAccessorImpl.invoke(NativeMethodAccessorImpl.java:62)
           [exec]     	at sun.reflect.DelegatingMethodAccessorImpl.invoke(DelegatingMethodAccessorImpl.java:43)
           [exec]     	at java.lang.reflect.Method.invoke(Method.java:498)
           [exec]     	at com.liferay.arquillian.extension.junit.bridge.server.TestExecutorRunnable$2.evaluate(TestExecutorRunnable.java:234)
           [exec]     	at org.junit.internal.runners.statements.RunBefores.evaluate(RunBefores.java:26)
           [exec]     	at org.junit.internal.runners.statements.RunAfters.evaluate(RunAfters.java:27)
           [exec]     	at com.liferay.portal.kernel.test.rule.BaseTestRule$1.evaluate(BaseTestRule.java:55)
           [exec]     	at com.liferay.portal.kernel.test.rule.BaseTestRule$1.evaluate(BaseTestRule.java:55)
           [exec]     	at com.liferay.portal.kernel.test.rule.BaseTestRule$1.evaluate(BaseTestRule.java:55)
           [exec]     	at com.liferay.portal.kernel.test.rule.BaseTestRule$1.evaluate(BaseTestRule.java:55)
           [exec]     	at com.liferay.portal.kernel.test.rule.BaseTestRule$1.evaluate(BaseTestRule.java:55)
           [exec]     	at com.liferay.portal.kernel.test.rule.BaseTestRule$1.evaluate(BaseTestRule.java:55)
           [exec]     	at com.liferay.portal.kernel.test.rule.BaseTestRule$1.evaluate(BaseTestRule.java:55)
           [exec]     	at com.liferay.portal.kernel.test.rule.BaseTestRule$1.evaluate(BaseTestRule.java:55)
           [exec]     	at com.liferay.portal.kernel.test.rule.BaseTestRule$1.evaluate(BaseTestRule.java:55)
           [exec]     	at com.liferay.portal.test.rule.LiferayIntegrationTestRule$1$1.evaluate(LiferayIntegrationTestRule.java:154)
           [exec]     	at com.liferay.portal.kernel.test.rule.BaseTestRule$1.evaluate(BaseTestRule.java:55)
           [exec]     	at com.liferay.portal.kernel.test.rule.TimeoutTestRule$1.evaluate(TimeoutTestRule.java:89)
           [exec]     	at org.junit.rules.RunRules.evaluate(RunRules.java:20)
           [exec]     	at com.liferay.arquillian.extension.junit.bridge.server.TestExecutorRunnable$1.evaluate(TestExecutorRunnable.java:143)
           [exec]     	at com.liferay.portal.kernel.test.rule.BaseTestRule$2.evaluate(BaseTestRule.java:72)
           [exec]     	at com.liferay.portal.kernel.test.rule.BaseTestRule$2.evaluate(BaseTestRule.java:72)
           [exec]     	at com.liferay.portal.kernel.test.rule.BaseTestRule$2.evaluate(BaseTestRule.java:72)
           [exec]     	at com.liferay.portal.kernel.test.rule.BaseTestRule$2.evaluate(BaseTestRule.java:72)
           [exec]     	at com.liferay.portal.kernel.test.rule.BaseTestRule$2.evaluate(BaseTestRule.java:72)
           [exec]     	at com.liferay.portal.kernel.test.rule.BaseTestRule$2.evaluate(BaseTestRule.java:72)
           [exec]     	at com.liferay.portal.kernel.test.rule.BaseTestRule$2.evaluate(BaseTestRule.java:72)
           [exec]     	at com.liferay.portal.kernel.test.rule.BaseTestRule$2.evaluate(BaseTestRule.java:72)
           [exec]     	at com.liferay.portal.kernel.test.rule.BaseTestRule$2.evaluate(BaseTestRule.java:72)
           [exec]     	at com.liferay.portal.test.rule.LiferayIntegrationTestRule$1$1.evaluate(LiferayIntegrationTestRule.java:154)
           [exec]     	at com.liferay.portal.kernel.test.rule.BaseTestRule$2.evaluate(BaseTestRule.java:72)
           [exec]     	at org.junit.rules.RunRules.evaluate(RunRules.java:20)
           [exec]     	at com.liferay.arquillian.extension.junit.bridge.server.TestExecutorRunnable._execute(TestExecutorRunnable.java:181)
           [exec]     	at com.liferay.arquillian.extension.junit.bridge.server.TestExecutorRunnable.run(TestExecutorRunnable.java:95)
           [exec]     	at java.lang.Thread.run(Thread.java:745)
           [exec] 
           [exec] com.liferay.archived.modules.upgrade.test.ArchivedModulesUpgradeTest > testDeprecatedModulesUpgradeTwitter STARTED
           [exec] 
           [exec] com.liferay.archived.modules.upgrade.test.ArchivedModulesUpgradeTest > testDeprecatedModulesUpgradeTwitter FAILED
           [exec]     java.lang.AssertionError: expected null, but was:<{mvccVersion=0, releaseId=77901, createDate=Mon May 24 18:55:10 GMT 2021, modifiedDate=Mon May 24 18:55:10 GMT 2021, servletContextName=com.liferay.twitter.service, schemaVersion=0.0.0, buildNumber=0, buildDate=null, verified=false, state=0, testString=}>
           [exec]     	at org.junit.Assert.fail(Assert.java:88)
           [exec]     	at org.junit.Assert.failNotNull(Assert.java:755)
           [exec]     	at org.junit.Assert.assertNull(Assert.java:737)
           [exec]     	at org.junit.Assert.assertNull(Assert.java:747)
           [exec]     	at com.liferay.archived.modules.upgrade.test.ArchivedModulesUpgradeTest._testDeprecatedModulesUpgrade(ArchivedModulesUpgradeTest.java:175)
           [exec]     	at com.liferay.archived.modules.upgrade.test.ArchivedModulesUpgradeTest.testDeprecatedModulesUpgradeTwitter(ArchivedModulesUpgradeTest.java:116)
           [exec]     	at sun.reflect.NativeMethodAccessorImpl.invoke0(Native Method)
           [exec]     	at sun.reflect.NativeMethodAccessorImpl.invoke(NativeMethodAccessorImpl.java:62)
           [exec]     	at sun.reflect.DelegatingMethodAccessorImpl.invoke(DelegatingMethodAccessorImpl.java:43)
           [exec]     	at java.lang.reflect.Method.invoke(Method.java:498)
           [exec]     	at com.liferay.arquillian.extension.junit.bridge.server.TestExecutorRunnable$2.evaluate(TestExecutorRunnable.java:234)
           [exec]     	at org.junit.internal.runners.statements.RunBefores.evaluate(RunBefores.java:26)
           [exec]     	at org.junit.internal.runners.statements.RunAfters.evaluate(RunAfters.java:27)
           [exec]     	at com.liferay.portal.kernel.test.rule.BaseTestRule$1.evaluate(BaseTestRule.java:55)
           [exec]     	at com.liferay.portal.kernel.test.rule.BaseTestRule$1.evaluate(BaseTestRule.java:55)
           [exec]     	at com.liferay.portal.kernel.test.rule.BaseTestRule$1.evaluate(BaseTestRule.java:55)
           [exec]     	at com.liferay.portal.kernel.test.rule.BaseTestRule$1.evaluate(BaseTestRule.java:55)
           [exec]     	at com.liferay.portal.kernel.test.rule.BaseTestRule$1.evaluate(BaseTestRule.java:55)
           [exec]     	at com.liferay.portal.kernel.test.rule.BaseTestRule$1.evaluate(BaseTestRule.java:55)
           [exec]     	at com.liferay.portal.kernel.test.rule.BaseTestRule$1.evaluate(BaseTestRule.java:55)
           [exec]     	at com.liferay.portal.kernel.test.rule.BaseTestRule$1.evaluate(BaseTestRule.java:55)
           [exec]     	at com.liferay.portal.kernel.test.rule.BaseTestRule$1.evaluate(BaseTestRule.java:55)
           [exec]     	at com.liferay.portal.test.rule.LiferayIntegrationTestRule$1$1.evaluate(LiferayIntegrationTestRule.java:154)
           [exec]     	at com.liferay.portal.kernel.test.rule.BaseTestRule$1.evaluate(BaseTestRule.java:55)
           [exec]     	at com.liferay.portal.kernel.test.rule.TimeoutTestRule$1.evaluate(TimeoutTestRule.java:89)
           [exec]     	at org.junit.rules.RunRules.evaluate(RunRules.java:20)
           [exec]     	at com.liferay.arquillian.extension.junit.bridge.server.TestExecutorRunnable$1.evaluate(TestExecutorRunnable.java:143)
           [exec]     	at com.liferay.portal.kernel.test.rule.BaseTestRule$2.evaluate(BaseTestRule.java:72)
           [exec]     	at com.liferay.portal.kernel.test.rule.BaseTestRule$2.evaluate(BaseTestRule.java:72)
           [exec]     	at com.liferay.portal.kernel.test.rule.BaseTestRule$2.evaluate(BaseTestRule.java:72)
           [exec]     	at com.liferay.portal.kernel.test.rule.BaseTestRule$2.evaluate(BaseTestRule.java:72)
           [exec]     	at com.liferay.portal.kernel.test.rule.BaseTestRule$2.evaluate(BaseTestRule.java:72)
           [exec]     	at com.liferay.portal.kernel.test.rule.BaseTestRule$2.evaluate(BaseTestRule.java:72)
           [exec]     	at com.liferay.portal.kernel.test.rule.BaseTestRule$2.evaluate(BaseTestRule.java:72)
           [exec]     	at com.liferay.portal.kernel.test.rule.BaseTestRule$2.evaluate(BaseTestRule.java:72)
           [exec]     	at com.liferay.portal.kernel.test.rule.BaseTestRule$2.evaluate(BaseTestRule.java:72)
           [exec]     	at com.liferay.portal.test.rule.LiferayIntegrationTestRule$1$1.evaluate(LiferayIntegrationTestRule.java:154)
           [exec]     	at com.liferay.portal.kernel.test.rule.BaseTestRule$2.evaluate(BaseTestRule.java:72)
           [exec]     	at org.junit.rules.RunRules.evaluate(RunRules.java:20)
           [exec]     	at com.liferay.arquillian.extension.junit.bridge.server.TestExecutorRunnable._execute(TestExecutorRunnable.java:181)
           [exec]     	at com.liferay.arquillian.extension.junit.bridge.server.TestExecutorRunnable.run(TestExecutorRunnable.java:95)
           [exec]     	at java.lang.Thread.run(Thread.java:745)
           [exec] 
           [exec] 18:55:10,582 INFO  [Arquillian-Connector-Thread][BundleStartStopLogger:49] STOPPED com.liferay.archived.modules.upgrade.test_1.0.0 [1152]
           [exec] 
           [exec] 5 tests completed, 5 failed
           [exec] 
           [exec] > Task :apps:archived:archived-modules-upgrade-test:testIntegration
           [exec] There were failing tests. See the report at: file:///opt/dev/projects/github/liferay-portal-7.1.x/modules/apps/archived/archived-modules-upgrade-test/build/reports/tests/testIntegration/index.html
      

      Full log.

        Attachments

          Activity

            People

            Assignee:
            team-upgrades Product Team Upgrades
            Reporter:
            harry.chai Harry Chai
            Participants of an Issue:
            Recent user:
            Sylvia Luan
            Votes:
            0 Vote for this issue
            Watchers:
            0 Start watching this issue

              Dates

              Created:
              Updated:
              Days since last comment:
              2 weeks, 4 days ago

                Packages

                Version Package