Uploaded image for project: 'PUBLIC - Liferay Portal Community Edition'
  1. PUBLIC - Liferay Portal Community Edition
  2. LPS-133919

NoClassDefFoundError for JSLoaderModulesServletTest

    Details

      Description

      Issue:

      modules-unit-jdk8/0

      https://test-1-18.liferay.com/job/test-portal-acceptance-pullrequest-batch(7.1.x)/AXIS_VARIABLE=0,label_exp=!master/43571/consoleFull

           [exec] com.liferay.frontend.js.loader.modules.extender.internal.JSLoaderModulesServletTest > testMultipleVersionsModuleOutput STARTED
           [exec] 
           [exec] com.liferay.frontend.js.loader.modules.extender.internal.JSLoaderModulesServletTest > testMultipleVersionsModuleOutput STANDARD_OUT
           [exec]     Loading jar:file:/opt/dev/projects/github/liferay-portal-7.1.x/.m2/com/liferay/portal/com.liferay.portal.impl/3.60.0-SNAPSHOT/com.liferay.portal.impl-3.60.0-SNAPSHOT.jar!/system.properties
           [exec]     Loading jar:file:/opt/dev/projects/github/liferay-portal-7.1.x/bundles/tomcat-9.0.43/webapps/ROOT/WEB-INF/lib/portal-impl.jar!/system.properties
           [exec]     Loading file:/opt/dev/projects/github/liferay-portal-7.1.x/bundles/tomcat-9.0.43/webapps/ROOT/WEB-INF/classes/system-ext.properties
           [exec]     Loading jar:file:/opt/dev/projects/github/liferay-portal-7.1.x/.m2/com/liferay/portal/com.liferay.portal.impl/3.60.0-SNAPSHOT/com.liferay.portal.impl-3.60.0-SNAPSHOT.jar!/portal.properties
           [exec]     Loading file:/opt/dev/projects/github/liferay-portal-7.1.x/bundles/tomcat-9.0.43/webapps/ROOT/WEB-INF/classes/portal-ext.properties
           [exec] 
           [exec] com.liferay.frontend.js.loader.modules.extender.internal.JSLoaderModulesServletTest > testMultipleVersionsModuleOutput FAILED
           [exec]     java.lang.NoClassDefFoundError: javax/servlet/http/HttpUpgradeHandler
           [exec]         at java.lang.Class.getDeclaredMethods0(Native Method)
           [exec]         at java.lang.Class.privateGetDeclaredMethods(Class.java:2701)
           [exec]         at java.lang.Class.getDeclaredMethod(Class.java:2128)
           [exec]         at org.mockito.cglib.proxy.Enhancer.getCallbacksSetter(Enhancer.java:631)
           [exec]         at org.mockito.cglib.proxy.Enhancer.isEnhanced(Enhancer.java:605)
           [exec]         at org.powermock.api.extension.proxyframework.ProxyFrameworkImpl.isProxy(ProxyFrameworkImpl.java:50)
           [exec]         at org.powermock.reflect.internal.WhiteboxImpl.getUnmockedType(WhiteboxImpl.java:1661)
           [exec]         at org.powermock.reflect.internal.WhiteboxImpl.getConstructor(WhiteboxImpl.java:240)
           [exec]         at org.powermock.core.MockGateway.newInstanceCall(MockGateway.java:212)
           [exec]         at com.liferay.frontend.js.loader.modules.extender.internal.JSLoaderModulesServletTest.testMultipleVersionsModuleOutput(JSLoaderModulesServletTest.java:189)
           [exec]         at sun.reflect.NativeMethodAccessorImpl.invoke0(Native Method)
           [exec]         at sun.reflect.NativeMethodAccessorImpl.invoke(NativeMethodAccessorImpl.java:62)
           [exec]         at sun.reflect.DelegatingMethodAccessorImpl.invoke(DelegatingMethodAccessorImpl.java:43)
           [exec]         at java.lang.reflect.Method.invoke(Method.java:498)
           [exec]         at org.junit.internal.runners.TestMethod.invoke(TestMethod.java:68)
           [exec]         at org.powermock.modules.junit4.internal.impl.PowerMockJUnit44RunnerDelegateImpl$PowerMockJUnit44MethodRunner.runTestMethod(PowerMockJUnit44RunnerDelegateImpl.java:310)
           [exec]         at org.junit.internal.runners.MethodRoadie$2.run(MethodRoadie.java:89)
           [exec]         at org.junit.internal.runners.MethodRoadie.runBeforesThenTestThenAfters(MethodRoadie.java:97)
           [exec]         at org.powermock.modules.junit4.internal.impl.PowerMockJUnit44RunnerDelegateImpl$PowerMockJUnit44MethodRunner.executeTest(PowerMockJUnit44RunnerDelegateImpl.java:294)
           [exec]         at org.powermock.modules.junit4.internal.impl.PowerMockJUnit47RunnerDelegateImpl$PowerMockJUnit47MethodRunner.executeTestInSuper(PowerMockJUnit47RunnerDelegateImpl.java:127)
           [exec]         at org.powermock.modules.junit4.internal.impl.PowerMockJUnit47RunnerDelegateImpl$PowerMockJUnit47MethodRunner.executeTest(PowerMockJUnit47RunnerDelegateImpl.java:82)
           [exec]         at org.powermock.modules.junit4.internal.impl.PowerMockJUnit44RunnerDelegateImpl$PowerMockJUnit44MethodRunner.runBeforesThenTestThenAfters(PowerMockJUnit44RunnerDelegateImpl.java:282)
           [exec]         at org.junit.internal.runners.MethodRoadie.runTest(MethodRoadie.java:87)
           [exec]         at org.junit.internal.runners.MethodRoadie.run(MethodRoadie.java:50)
           [exec]         at org.powermock.modules.junit4.internal.impl.PowerMockJUnit44RunnerDelegateImpl.invokeTestMethod(PowerMockJUnit44RunnerDelegateImpl.java:207)
           [exec]         at org.powermock.modules.junit4.internal.impl.PowerMockJUnit44RunnerDelegateImpl.runMethods(PowerMockJUnit44RunnerDelegateImpl.java:146)
           [exec]         at org.powermock.modules.junit4.internal.impl.PowerMockJUnit44RunnerDelegateImpl$1.run(PowerMockJUnit44RunnerDelegateImpl.java:120)
           [exec]         at org.junit.internal.runners.ClassRoadie.runUnprotected(ClassRoadie.java:34)
           [exec]         at org.junit.internal.runners.ClassRoadie.runProtected(ClassRoadie.java:44)
           [exec]         at org.powermock.modules.junit4.internal.impl.PowerMockJUnit44RunnerDelegateImpl.run(PowerMockJUnit44RunnerDelegateImpl.java:122)
           [exec]         at org.powermock.modules.junit4.common.internal.impl.JUnit4TestSuiteChunkerImpl.run(JUnit4TestSuiteChunkerImpl.java:106)
           [exec]         at org.powermock.modules.junit4.common.internal.impl.AbstractCommonPowerMockRunner.run(AbstractCommonPowerMockRunner.java:53)
           [exec]         at org.powermock.modules.junit4.PowerMockRunner.run(PowerMockRunner.java:59)
           [exec]         at org.gradle.api.internal.tasks.testing.junit.JUnitTestClassExecutor.runTestClass(JUnitTestClassExecutor.java:110)
           [exec]         at org.gradle.api.internal.tasks.testing.junit.JUnitTestClassExecutor.execute(JUnitTestClassExecutor.java:58)
           [exec]         at org.gradle.api.internal.tasks.testing.junit.JUnitTestClassExecutor.execute(JUnitTestClassExecutor.java:38)
           [exec]         at org.gradle.api.internal.tasks.testing.junit.AbstractJUnitTestClassProcessor.processTestClass(AbstractJUnitTestClassProcessor.java:62)
           [exec]         at org.gradle.api.internal.tasks.testing.SuiteTestClassProcessor.processTestClass(SuiteTestClassProcessor.java:51)
           [exec]         at sun.reflect.NativeMethodAccessorImpl.invoke0(Native Method)
           [exec]         at sun.reflect.NativeMethodAccessorImpl.invoke(NativeMethodAccessorImpl.java:62)
           [exec]         at sun.reflect.DelegatingMethodAccessorImpl.invoke(DelegatingMethodAccessorImpl.java:43)
           [exec]         at java.lang.reflect.Method.invoke(Method.java:498)
           [exec]         at org.gradle.internal.dispatch.ReflectionDispatch.dispatch(ReflectionDispatch.java:36)
           [exec]         at org.gradle.internal.dispatch.ReflectionDispatch.dispatch(ReflectionDispatch.java:24)
           [exec]         at org.gradle.internal.dispatch.ContextClassLoaderDispatch.dispatch(ContextClassLoaderDispatch.java:33)
           [exec]         at org.gradle.internal.dispatch.ProxyDispatchAdapter$DispatchingInvocationHandler.invoke(ProxyDispatchAdapter.java:94)
           [exec]         at com.sun.proxy.$Proxy2.processTestClass(Unknown Source)
           [exec]         at org.gradle.api.internal.tasks.testing.worker.TestWorker.processTestClass(TestWorker.java:119)
           [exec]         at sun.reflect.NativeMethodAccessorImpl.invoke0(Native Method)
           [exec]         at sun.reflect.NativeMethodAccessorImpl.invoke(NativeMethodAccessorImpl.java:62)
           [exec]         at sun.reflect.DelegatingMethodAccessorImpl.invoke(DelegatingMethodAccessorImpl.java:43)
           [exec]         at java.lang.reflect.Method.invoke(Method.java:498)
           [exec]         at org.gradle.internal.dispatch.ReflectionDispatch.dispatch(ReflectionDispatch.java:36)
           [exec]         at org.gradle.internal.dispatch.ReflectionDispatch.dispatch(ReflectionDispatch.java:24)
           [exec]         at org.gradle.internal.remote.internal.hub.MessageHubBackedObjectConnection$DispatchWrapper.dispatch(MessageHubBackedObjectConnection.java:182)
           [exec]         at org.gradle.internal.remote.internal.hub.MessageHubBackedObjectConnection$DispatchWrapper.dispatch(MessageHubBackedObjectConnection.java:164)
           [exec]         at org.gradle.internal.remote.internal.hub.MessageHub$Handler.run(MessageHub.java:414)
           [exec]         at org.gradle.internal.concurrent.ExecutorPolicy$CatchAndRecordFailures.onExecute(ExecutorPolicy.java:64)
           [exec]         at org.gradle.internal.concurrent.ManagedExecutorImpl$1.run(ManagedExecutorImpl.java:48)
           [exec]         at java.util.concurrent.ThreadPoolExecutor.runWorker(ThreadPoolExecutor.java:1142)
           [exec]         at java.util.concurrent.ThreadPoolExecutor$Worker.run(ThreadPoolExecutor.java:617)
           [exec]         at org.gradle.internal.concurrent.ThreadFactoryImpl$ManagedThreadRunnable.run(ThreadFactoryImpl.java:56)
           [exec]         at java.lang.Thread.run(Thread.java:745)
           [exec] 
           [exec]         Caused by:
           [exec]         java.lang.ClassNotFoundException: javax.servlet.http.HttpUpgradeHandler
           [exec]             at java.net.URLClassLoader.findClass(URLClassLoader.java:381)
           [exec]             at java.lang.ClassLoader.loadClass(ClassLoader.java:424)
           [exec]             at sun.misc.Launcher$AppClassLoader.loadClass(Launcher.java:331)
           [exec]             at java.lang.ClassLoader.loadClass(ClassLoader.java:357)
           [exec]             at org.powermock.core.classloader.MockClassLoader.loadModifiedClass(MockClassLoader.java:178)
           [exec]             at org.powermock.core.classloader.DeferSupportingClassLoader.loadClass(DeferSupportingClassLoader.java:68)
           [exec]             at java.lang.ClassLoader.loadClass(ClassLoader.java:357)
           [exec]             ... 63 more
           [exec] 
           [exec] com.liferay.frontend.js.loader.modules.extender.internal.JSLoaderModulesServletTest > testSingleModuleOutput STARTED
           [exec] 
           [exec] com.liferay.frontend.js.loader.modules.extender.internal.JSLoaderModulesServletTest > testSingleModuleOutput FAILED
           [exec]     java.lang.NoClassDefFoundError: javax/servlet/http/HttpUpgradeHandler
           [exec]         at java.lang.Class.getDeclaredMethods0(Native Method)
           [exec]         at java.lang.Class.privateGetDeclaredMethods(Class.java:2701)
           [exec]         at java.lang.Class.getDeclaredMethod(Class.java:2128)
           [exec]         at org.mockito.cglib.proxy.Enhancer.getCallbacksSetter(Enhancer.java:631)
           [exec]         at org.mockito.cglib.proxy.Enhancer.isEnhanced(Enhancer.java:605)
           [exec]         at org.powermock.api.extension.proxyframework.ProxyFrameworkImpl.isProxy(ProxyFrameworkImpl.java:50)
           [exec]         at org.powermock.reflect.internal.WhiteboxImpl.getUnmockedType(WhiteboxImpl.java:1661)
           [exec]         at org.powermock.reflect.internal.WhiteboxImpl.getConstructor(WhiteboxImpl.java:240)
           [exec]         at org.powermock.core.MockGateway.newInstanceCall(MockGateway.java:212)
           [exec]         at com.liferay.frontend.js.loader.modules.extender.internal.JSLoaderModulesServletTest.testSingleModuleOutput(JSLoaderModulesServletTest.java:237)
           [exec]         at sun.reflect.NativeMethodAccessorImpl.invoke0(Native Method)
           [exec]         at sun.reflect.NativeMethodAccessorImpl.invoke(NativeMethodAccessorImpl.java:62)
           [exec]         at sun.reflect.DelegatingMethodAccessorImpl.invoke(DelegatingMethodAccessorImpl.java:43)
           [exec]         at java.lang.reflect.Method.invoke(Method.java:498)
           [exec]         at org.junit.internal.runners.TestMethod.invoke(TestMethod.java:68)
           [exec]         at org.powermock.modules.junit4.internal.impl.PowerMockJUnit44RunnerDelegateImpl$PowerMockJUnit44MethodRunner.runTestMethod(PowerMockJUnit44RunnerDelegateImpl.java:310)
           [exec]         at org.junit.internal.runners.MethodRoadie$2.run(MethodRoadie.java:89)
           [exec]         at org.junit.internal.runners.MethodRoadie.runBeforesThenTestThenAfters(MethodRoadie.java:97)
           [exec]         at org.powermock.modules.junit4.internal.impl.PowerMockJUnit44RunnerDelegateImpl$PowerMockJUnit44MethodRunner.executeTest(PowerMockJUnit44RunnerDelegateImpl.java:294)
           [exec]         at org.powermock.modules.junit4.internal.impl.PowerMockJUnit47RunnerDelegateImpl$PowerMockJUnit47MethodRunner.executeTestInSuper(PowerMockJUnit47RunnerDelegateImpl.java:127)
           [exec]         at org.powermock.modules.junit4.internal.impl.PowerMockJUnit47RunnerDelegateImpl$PowerMockJUnit47MethodRunner.executeTest(PowerMockJUnit47RunnerDelegateImpl.java:82)
           [exec]         at org.powermock.modules.junit4.internal.impl.PowerMockJUnit44RunnerDelegateImpl$PowerMockJUnit44MethodRunner.runBeforesThenTestThenAfters(PowerMockJUnit44RunnerDelegateImpl.java:282)
           [exec]         at org.junit.internal.runners.MethodRoadie.runTest(MethodRoadie.java:87)
           [exec]         at org.junit.internal.runners.MethodRoadie.run(MethodRoadie.java:50)
           [exec]         at org.powermock.modules.junit4.internal.impl.PowerMockJUnit44RunnerDelegateImpl.invokeTestMethod(PowerMockJUnit44RunnerDelegateImpl.java:207)
           [exec]         at org.powermock.modules.junit4.internal.impl.PowerMockJUnit44RunnerDelegateImpl.runMethods(PowerMockJUnit44RunnerDelegateImpl.java:146)
           [exec]         at org.powermock.modules.junit4.internal.impl.PowerMockJUnit44RunnerDelegateImpl$1.run(PowerMockJUnit44RunnerDelegateImpl.java:120)
           [exec]         at org.junit.internal.runners.ClassRoadie.runUnprotected(ClassRoadie.java:34)
           [exec]         at org.junit.internal.runners.ClassRoadie.runProtected(ClassRoadie.java:44)
           [exec]         at org.powermock.modules.junit4.internal.impl.PowerMockJUnit44RunnerDelegateImpl.run(PowerMockJUnit44RunnerDelegateImpl.java:122)
           [exec]         at org.powermock.modules.junit4.common.internal.impl.JUnit4TestSuiteChunkerImpl.run(JUnit4TestSuiteChunkerImpl.java:106)
           [exec]         at org.powermock.modules.junit4.common.internal.impl.AbstractCommonPowerMockRunner.run(AbstractCommonPowerMockRunner.java:53)
           [exec]         at org.powermock.modules.junit4.PowerMockRunner.run(PowerMockRunner.java:59)
           [exec]         at org.gradle.api.internal.tasks.testing.junit.JUnitTestClassExecutor.runTestClass(JUnitTestClassExecutor.java:110)
           [exec]         at org.gradle.api.internal.tasks.testing.junit.JUnitTestClassExecutor.execute(JUnitTestClassExecutor.java:58)
           [exec]         at org.gradle.api.internal.tasks.testing.junit.JUnitTestClassExecutor.execute(JUnitTestClassExecutor.java:38)
           [exec]         at org.gradle.api.internal.tasks.testing.junit.AbstractJUnitTestClassProcessor.processTestClass(AbstractJUnitTestClassProcessor.java:62)
           [exec]         at org.gradle.api.internal.tasks.testing.SuiteTestClassProcessor.processTestClass(SuiteTestClassProcessor.java:51)
           [exec]         at sun.reflect.NativeMethodAccessorImpl.invoke0(Native Method)
           [exec]         at sun.reflect.NativeMethodAccessorImpl.invoke(NativeMethodAccessorImpl.java:62)
           [exec]         at sun.reflect.DelegatingMethodAccessorImpl.invoke(DelegatingMethodAccessorImpl.java:43)
           [exec]         at java.lang.reflect.Method.invoke(Method.java:498)
           [exec]         at org.gradle.internal.dispatch.ReflectionDispatch.dispatch(ReflectionDispatch.java:36)
           [exec]         at org.gradle.internal.dispatch.ReflectionDispatch.dispatch(ReflectionDispatch.java:24)
           [exec]         at org.gradle.internal.dispatch.ContextClassLoaderDispatch.dispatch(ContextClassLoaderDispatch.java:33)
           [exec]         at org.gradle.internal.dispatch.ProxyDispatchAdapter$DispatchingInvocationHandler.invoke(ProxyDispatchAdapter.java:94)
           [exec]         at com.sun.proxy.$Proxy2.processTestClass(Unknown Source)
           [exec]         at org.gradle.api.internal.tasks.testing.worker.TestWorker.processTestClass(TestWorker.java:119)
           [exec]         at sun.reflect.NativeMethodAccessorImpl.invoke0(Native Method)
           [exec]         at sun.reflect.NativeMethodAccessorImpl.invoke(NativeMethodAccessorImpl.java:62)
           [exec]         at sun.reflect.DelegatingMethodAccessorImpl.invoke(DelegatingMethodAccessorImpl.java:43)
           [exec]         at java.lang.reflect.Method.invoke(Method.java:498)
           [exec]         at org.gradle.internal.dispatch.ReflectionDispatch.dispatch(ReflectionDispatch.java:36)
           [exec]         at org.gradle.internal.dispatch.ReflectionDispatch.dispatch(ReflectionDispatch.java:24)
           [exec]         at org.gradle.internal.remote.internal.hub.MessageHubBackedObjectConnection$DispatchWrapper.dispatch(MessageHubBackedObjectConnection.java:182)
           [exec]         at org.gradle.internal.remote.internal.hub.MessageHubBackedObjectConnection$DispatchWrapper.dispatch(MessageHubBackedObjectConnection.java:164)
           [exec]         at org.gradle.internal.remote.internal.hub.MessageHub$Handler.run(MessageHub.java:414)
           [exec]         at org.gradle.internal.concurrent.ExecutorPolicy$CatchAndRecordFailures.onExecute(ExecutorPolicy.java:64)
           [exec]         at org.gradle.internal.concurrent.ManagedExecutorImpl$1.run(ManagedExecutorImpl.java:48)
           [exec]         at java.util.concurrent.ThreadPoolExecutor.runWorker(ThreadPoolExecutor.java:1142)
           [exec]         at java.util.concurrent.ThreadPoolExecutor$Worker.run(ThreadPoolExecutor.java:617)
           [exec]         at org.gradle.internal.concurrent.ThreadFactoryImpl$ManagedThreadRunnable.run(ThreadFactoryImpl.java:56)
           [exec]         at java.lang.Thread.run(Thread.java:745)
           [exec] 
           [exec]         Caused by:
           [exec]         java.lang.ClassNotFoundException: javax.servlet.http.HttpUpgradeHandler
           [exec]             at java.net.URLClassLoader.findClass(URLClassLoader.java:381)
           [exec]             at java.lang.ClassLoader.loadClass(ClassLoader.java:424)
           [exec]             at sun.misc.Launcher$AppClassLoader.loadClass(Launcher.java:331)
           [exec]             at java.lang.ClassLoader.loadClass(ClassLoader.java:357)
           [exec]             at org.powermock.core.classloader.MockClassLoader.loadModifiedClass(MockClassLoader.java:178)
           [exec]             at org.powermock.core.classloader.DeferSupportingClassLoader.loadClass(DeferSupportingClassLoader.java:68)
           [exec]             at java.lang.ClassLoader.loadClass(ClassLoader.java:357)
           [exec]             ... 63 more
           [exec] 
           [exec] com.liferay.frontend.js.loader.modules.extender.internal.JSLoaderModulesServletTest > testSingleModuleOutputIdempotent STARTED
           [exec] 
           [exec] com.liferay.frontend.js.loader.modules.extender.internal.JSLoaderModulesServletTest > testSingleModuleOutputIdempotent FAILED
           [exec]     java.lang.NoClassDefFoundError: javax/servlet/http/HttpUpgradeHandler
           [exec]         at java.lang.Class.getDeclaredMethods0(Native Method)
           [exec]         at java.lang.Class.privateGetDeclaredMethods(Class.java:2701)
           [exec]         at java.lang.Class.getDeclaredMethod(Class.java:2128)
           [exec]         at org.mockito.cglib.proxy.Enhancer.getCallbacksSetter(Enhancer.java:631)
           [exec]         at org.mockito.cglib.proxy.Enhancer.isEnhanced(Enhancer.java:605)
           [exec]         at org.powermock.api.extension.proxyframework.ProxyFrameworkImpl.isProxy(ProxyFrameworkImpl.java:50)
           [exec]         at org.powermock.reflect.internal.WhiteboxImpl.getUnmockedType(WhiteboxImpl.java:1661)
           [exec]         at org.powermock.reflect.internal.WhiteboxImpl.getConstructor(WhiteboxImpl.java:240)
           [exec]         at org.powermock.core.MockGateway.newInstanceCall(MockGateway.java:212)
           [exec]         at com.liferay.frontend.js.loader.modules.extender.internal.JSLoaderModulesServletTest.testSingleModuleOutputIdempotent(JSLoaderModulesServletTest.java:297)
           [exec]         at sun.reflect.NativeMethodAccessorImpl.invoke0(Native Method)
           [exec]         at sun.reflect.NativeMethodAccessorImpl.invoke(NativeMethodAccessorImpl.java:62)
           [exec]         at sun.reflect.DelegatingMethodAccessorImpl.invoke(DelegatingMethodAccessorImpl.java:43)
           [exec]         at java.lang.reflect.Method.invoke(Method.java:498)
           [exec]         at org.junit.internal.runners.TestMethod.invoke(TestMethod.java:68)
           [exec]         at org.powermock.modules.junit4.internal.impl.PowerMockJUnit44RunnerDelegateImpl$PowerMockJUnit44MethodRunner.runTestMethod(PowerMockJUnit44RunnerDelegateImpl.java:310)
           [exec]         at org.junit.internal.runners.MethodRoadie$2.run(MethodRoadie.java:89)
           [exec]         at org.junit.internal.runners.MethodRoadie.runBeforesThenTestThenAfters(MethodRoadie.java:97)
           [exec]         at org.powermock.modules.junit4.internal.impl.PowerMockJUnit44RunnerDelegateImpl$PowerMockJUnit44MethodRunner.executeTest(PowerMockJUnit44RunnerDelegateImpl.java:294)
           [exec]         at org.powermock.modules.junit4.internal.impl.PowerMockJUnit47RunnerDelegateImpl$PowerMockJUnit47MethodRunner.executeTestInSuper(PowerMockJUnit47RunnerDelegateImpl.java:127)
           [exec]         at org.powermock.modules.junit4.internal.impl.PowerMockJUnit47RunnerDelegateImpl$PowerMockJUnit47MethodRunner.executeTest(PowerMockJUnit47RunnerDelegateImpl.java:82)
           [exec]         at org.powermock.modules.junit4.internal.impl.PowerMockJUnit44RunnerDelegateImpl$PowerMockJUnit44MethodRunner.runBeforesThenTestThenAfters(PowerMockJUnit44RunnerDelegateImpl.java:282)
           [exec]         at org.junit.internal.runners.MethodRoadie.runTest(MethodRoadie.java:87)
           [exec]         at org.junit.internal.runners.MethodRoadie.run(MethodRoadie.java:50)
           [exec]         at org.powermock.modules.junit4.internal.impl.PowerMockJUnit44RunnerDelegateImpl.invokeTestMethod(PowerMockJUnit44RunnerDelegateImpl.java:207)
           [exec]         at org.powermock.modules.junit4.internal.impl.PowerMockJUnit44RunnerDelegateImpl.runMethods(PowerMockJUnit44RunnerDelegateImpl.java:146)
           [exec]         at org.powermock.modules.junit4.internal.impl.PowerMockJUnit44RunnerDelegateImpl$1.run(PowerMockJUnit44RunnerDelegateImpl.java:120)
           [exec]         at org.junit.internal.runners.ClassRoadie.runUnprotected(ClassRoadie.java:34)
           [exec]         at org.junit.internal.runners.ClassRoadie.runProtected(ClassRoadie.java:44)
           [exec]         at org.powermock.modules.junit4.internal.impl.PowerMockJUnit44RunnerDelegateImpl.run(PowerMockJUnit44RunnerDelegateImpl.java:122)
           [exec]         at org.powermock.modules.junit4.common.internal.impl.JUnit4TestSuiteChunkerImpl.run(JUnit4TestSuiteChunkerImpl.java:106)
           [exec]         at org.powermock.modules.junit4.common.internal.impl.AbstractCommonPowerMockRunner.run(AbstractCommonPowerMockRunner.java:53)
           [exec]         at org.powermock.modules.junit4.PowerMockRunner.run(PowerMockRunner.java:59)
           [exec]         at org.gradle.api.internal.tasks.testing.junit.JUnitTestClassExecutor.runTestClass(JUnitTestClassExecutor.java:110)
           [exec]         at org.gradle.api.internal.tasks.testing.junit.JUnitTestClassExecutor.execute(JUnitTestClassExecutor.java:58)
           [exec]         at org.gradle.api.internal.tasks.testing.junit.JUnitTestClassExecutor.execute(JUnitTestClassExecutor.java:38)
           [exec]         at org.gradle.api.internal.tasks.testing.junit.AbstractJUnitTestClassProcessor.processTestClass(AbstractJUnitTestClassProcessor.java:62)
           [exec]         at org.gradle.api.internal.tasks.testing.SuiteTestClassProcessor.processTestClass(SuiteTestClassProcessor.java:51)
           [exec]         at sun.reflect.NativeMethodAccessorImpl.invoke0(Native Method)
           [exec]         at sun.reflect.NativeMethodAccessorImpl.invoke(NativeMethodAccessorImpl.java:62)
           [exec]         at sun.reflect.DelegatingMethodAccessorImpl.invoke(DelegatingMethodAccessorImpl.java:43)
           [exec]         at java.lang.reflect.Method.invoke(Method.java:498)
           [exec]         at org.gradle.internal.dispatch.ReflectionDispatch.dispatch(ReflectionDispatch.java:36)
           [exec]         at org.gradle.internal.dispatch.ReflectionDispatch.dispatch(ReflectionDispatch.java:24)
           [exec]         at org.gradle.internal.dispatch.ContextClassLoaderDispatch.dispatch(ContextClassLoaderDispatch.java:33)
           [exec]         at org.gradle.internal.dispatch.ProxyDispatchAdapter$DispatchingInvocationHandler.invoke(ProxyDispatchAdapter.java:94)
           [exec]         at com.sun.proxy.$Proxy2.processTestClass(Unknown Source)
           [exec]         at org.gradle.api.internal.tasks.testing.worker.TestWorker.processTestClass(TestWorker.java:119)
           [exec]         at sun.reflect.NativeMethodAccessorImpl.invoke0(Native Method)
           [exec]         at sun.reflect.NativeMethodAccessorImpl.invoke(NativeMethodAccessorImpl.java:62)
           [exec]         at sun.reflect.DelegatingMethodAccessorImpl.invoke(DelegatingMethodAccessorImpl.java:43)
           [exec]         at java.lang.reflect.Method.invoke(Method.java:498)
           [exec]         at org.gradle.internal.dispatch.ReflectionDispatch.dispatch(ReflectionDispatch.java:36)
           [exec]         at org.gradle.internal.dispatch.ReflectionDispatch.dispatch(ReflectionDispatch.java:24)
           [exec]         at org.gradle.internal.remote.internal.hub.MessageHubBackedObjectConnection$DispatchWrapper.dispatch(MessageHubBackedObjectConnection.java:182)
           [exec]         at org.gradle.internal.remote.internal.hub.MessageHubBackedObjectConnection$DispatchWrapper.dispatch(MessageHubBackedObjectConnection.java:164)
           [exec]         at org.gradle.internal.remote.internal.hub.MessageHub$Handler.run(MessageHub.java:414)
           [exec]         at org.gradle.internal.concurrent.ExecutorPolicy$CatchAndRecordFailures.onExecute(ExecutorPolicy.java:64)
           [exec]         at org.gradle.internal.concurrent.ManagedExecutorImpl$1.run(ManagedExecutorImpl.java:48)
           [exec]         at java.util.concurrent.ThreadPoolExecutor.runWorker(ThreadPoolExecutor.java:1142)
           [exec]         at java.util.concurrent.ThreadPoolExecutor$Worker.run(ThreadPoolExecutor.java:617)
           [exec]         at org.gradle.internal.concurrent.ThreadFactoryImpl$ManagedThreadRunnable.run(ThreadFactoryImpl.java:56)
           [exec]         at java.lang.Thread.run(Thread.java:745)
           [exec] 
           [exec]         Caused by:
           [exec]         java.lang.ClassNotFoundException: javax.servlet.http.HttpUpgradeHandler
           [exec]             at java.net.URLClassLoader.findClass(URLClassLoader.java:381)
           [exec]             at java.lang.ClassLoader.loadClass(ClassLoader.java:424)
           [exec]             at sun.misc.Launcher$AppClassLoader.loadClass(Launcher.java:331)
           [exec]             at java.lang.ClassLoader.loadClass(ClassLoader.java:357)
           [exec]             at org.powermock.core.classloader.MockClassLoader.loadModifiedClass(MockClassLoader.java:178)
           [exec]             at org.powermock.core.classloader.DeferSupportingClassLoader.loadClass(DeferSupportingClassLoader.java:68)
           [exec]             at java.lang.ClassLoader.loadClass(ClassLoader.java:357)
           [exec]             ... 63 more
           [exec] 
           [exec] com.liferay.frontend.js.loader.modules.extender.internal.JSLoaderModulesServletTest > testSingleModuleOutputMalformedConfiguration STARTED
           [exec] 
           [exec] com.liferay.frontend.js.loader.modules.extender.internal.JSLoaderModulesServletTest > testSingleModuleOutputMalformedConfiguration PASSED
           [exec] 
           [exec] com.liferay.frontend.js.loader.modules.extender.internal.JSLoaderModulesServletTest > testUnversionedModuleOutput STARTED
           [exec] 
           [exec] com.liferay.frontend.js.loader.modules.extender.internal.JSLoaderModulesServletTest > testUnversionedModuleOutput FAILED
           [exec]     java.lang.NoClassDefFoundError: javax/servlet/http/HttpUpgradeHandler
           [exec]         at java.lang.Class.getDeclaredMethods0(Native Method)
           [exec]         at java.lang.Class.privateGetDeclaredMethods(Class.java:2701)
           [exec]         at java.lang.Class.getDeclaredMethod(Class.java:2128)
           [exec]         at org.mockito.cglib.proxy.Enhancer.getCallbacksSetter(Enhancer.java:631)
           [exec]         at org.mockito.cglib.proxy.Enhancer.isEnhanced(Enhancer.java:605)
           [exec]         at org.powermock.api.extension.proxyframework.ProxyFrameworkImpl.isProxy(ProxyFrameworkImpl.java:50)
           [exec]         at org.powermock.reflect.internal.WhiteboxImpl.getUnmockedType(WhiteboxImpl.java:1661)
           [exec]         at org.powermock.reflect.internal.WhiteboxImpl.getConstructor(WhiteboxImpl.java:240)
           [exec]         at org.powermock.core.MockGateway.newInstanceCall(MockGateway.java:212)
           [exec]         at com.liferay.frontend.js.loader.modules.extender.internal.JSLoaderModulesServletTest.testUnversionedModuleOutput(JSLoaderModulesServletTest.java:368)
           [exec]         at sun.reflect.NativeMethodAccessorImpl.invoke0(Native Method)
           [exec]         at sun.reflect.NativeMethodAccessorImpl.invoke(NativeMethodAccessorImpl.java:62)
           [exec]         at sun.reflect.DelegatingMethodAccessorImpl.invoke(DelegatingMethodAccessorImpl.java:43)
           [exec]         at java.lang.reflect.Method.invoke(Method.java:498)
           [exec]         at org.junit.internal.runners.TestMethod.invoke(TestMethod.java:68)
           [exec]         at org.powermock.modules.junit4.internal.impl.PowerMockJUnit44RunnerDelegateImpl$PowerMockJUnit44MethodRunner.runTestMethod(PowerMockJUnit44RunnerDelegateImpl.java:310)
           [exec]         at org.junit.internal.runners.MethodRoadie$2.run(MethodRoadie.java:89)
           [exec]         at org.junit.internal.runners.MethodRoadie.runBeforesThenTestThenAfters(MethodRoadie.java:97)
           [exec]         at org.powermock.modules.junit4.internal.impl.PowerMockJUnit44RunnerDelegateImpl$PowerMockJUnit44MethodRunner.executeTest(PowerMockJUnit44RunnerDelegateImpl.java:294)
           [exec]         at org.powermock.modules.junit4.internal.impl.PowerMockJUnit47RunnerDelegateImpl$PowerMockJUnit47MethodRunner.executeTestInSuper(PowerMockJUnit47RunnerDelegateImpl.java:127)
           [exec]         at org.powermock.modules.junit4.internal.impl.PowerMockJUnit47RunnerDelegateImpl$PowerMockJUnit47MethodRunner.executeTest(PowerMockJUnit47RunnerDelegateImpl.java:82)
           [exec]         at org.powermock.modules.junit4.internal.impl.PowerMockJUnit44RunnerDelegateImpl$PowerMockJUnit44MethodRunner.runBeforesThenTestThenAfters(PowerMockJUnit44RunnerDelegateImpl.java:282)
           [exec]         at org.junit.internal.runners.MethodRoadie.runTest(MethodRoadie.java:87)
           [exec]         at org.junit.internal.runners.MethodRoadie.run(MethodRoadie.java:50)
           [exec]         at org.powermock.modules.junit4.internal.impl.PowerMockJUnit44RunnerDelegateImpl.invokeTestMethod(PowerMockJUnit44RunnerDelegateImpl.java:207)
           [exec]         at org.powermock.modules.junit4.internal.impl.PowerMockJUnit44RunnerDelegateImpl.runMethods(PowerMockJUnit44RunnerDelegateImpl.java:146)
           [exec]         at org.powermock.modules.junit4.internal.impl.PowerMockJUnit44RunnerDelegateImpl$1.run(PowerMockJUnit44RunnerDelegateImpl.java:120)
           [exec]         at org.junit.internal.runners.ClassRoadie.runUnprotected(ClassRoadie.java:34)
           [exec]         at org.junit.internal.runners.ClassRoadie.runProtected(ClassRoadie.java:44)
           [exec]         at org.powermock.modules.junit4.internal.impl.PowerMockJUnit44RunnerDelegateImpl.run(PowerMockJUnit44RunnerDelegateImpl.java:122)
           [exec]         at org.powermock.modules.junit4.common.internal.impl.JUnit4TestSuiteChunkerImpl.run(JUnit4TestSuiteChunkerImpl.java:106)
           [exec]         at org.powermock.modules.junit4.common.internal.impl.AbstractCommonPowerMockRunner.run(AbstractCommonPowerMockRunner.java:53)
           [exec]         at org.powermock.modules.junit4.PowerMockRunner.run(PowerMockRunner.java:59)
           [exec]         at org.gradle.api.internal.tasks.testing.junit.JUnitTestClassExecutor.runTestClass(JUnitTestClassExecutor.java:110)
           [exec]         at org.gradle.api.internal.tasks.testing.junit.JUnitTestClassExecutor.execute(JUnitTestClassExecutor.java:58)
           [exec]         at org.gradle.api.internal.tasks.testing.junit.JUnitTestClassExecutor.execute(JUnitTestClassExecutor.java:38)
           [exec]         at org.gradle.api.internal.tasks.testing.junit.AbstractJUnitTestClassProcessor.processTestClass(AbstractJUnitTestClassProcessor.java:62)
           [exec]         at org.gradle.api.internal.tasks.testing.SuiteTestClassProcessor.processTestClass(SuiteTestClassProcessor.java:51)
           [exec]         at sun.reflect.NativeMethodAccessorImpl.invoke0(Native Method)
           [exec]         at sun.reflect.NativeMethodAccessorImpl.invoke(NativeMethodAccessorImpl.java:62)
           [exec]         at sun.reflect.DelegatingMethodAccessorImpl.invoke(DelegatingMethodAccessorImpl.java:43)
           [exec]         at java.lang.reflect.Method.invoke(Method.java:498)
           [exec]         at org.gradle.internal.dispatch.ReflectionDispatch.dispatch(ReflectionDispatch.java:36)
           [exec]         at org.gradle.internal.dispatch.ReflectionDispatch.dispatch(ReflectionDispatch.java:24)
           [exec]         at org.gradle.internal.dispatch.ContextClassLoaderDispatch.dispatch(ContextClassLoaderDispatch.java:33)
           [exec]         at org.gradle.internal.dispatch.ProxyDispatchAdapter$DispatchingInvocationHandler.invoke(ProxyDispatchAdapter.java:94)
           [exec]         at com.sun.proxy.$Proxy2.processTestClass(Unknown Source)
           [exec]         at org.gradle.api.internal.tasks.testing.worker.TestWorker.processTestClass(TestWorker.java:119)
           [exec]         at sun.reflect.NativeMethodAccessorImpl.invoke0(Native Method)
           [exec]         at sun.reflect.NativeMethodAccessorImpl.invoke(NativeMethodAccessorImpl.java:62)
           [exec]         at sun.reflect.DelegatingMethodAccessorImpl.invoke(DelegatingMethodAccessorImpl.java:43)
           [exec]         at java.lang.reflect.Method.invoke(Method.java:498)
           [exec]         at org.gradle.internal.dispatch.ReflectionDispatch.dispatch(ReflectionDispatch.java:36)
           [exec]         at org.gradle.internal.dispatch.ReflectionDispatch.dispatch(ReflectionDispatch.java:24)
           [exec]         at org.gradle.internal.remote.internal.hub.MessageHubBackedObjectConnection$DispatchWrapper.dispatch(MessageHubBackedObjectConnection.java:182)
           [exec]         at org.gradle.internal.remote.internal.hub.MessageHubBackedObjectConnection$DispatchWrapper.dispatch(MessageHubBackedObjectConnection.java:164)
           [exec]         at org.gradle.internal.remote.internal.hub.MessageHub$Handler.run(MessageHub.java:414)
           [exec]         at org.gradle.internal.concurrent.ExecutorPolicy$CatchAndRecordFailures.onExecute(ExecutorPolicy.java:64)
           [exec]         at org.gradle.internal.concurrent.ManagedExecutorImpl$1.run(ManagedExecutorImpl.java:48)
           [exec]         at java.util.concurrent.ThreadPoolExecutor.runWorker(ThreadPoolExecutor.java:1142)
           [exec]         at java.util.concurrent.ThreadPoolExecutor$Worker.run(ThreadPoolExecutor.java:617)
           [exec]         at org.gradle.internal.concurrent.ThreadFactoryImpl$ManagedThreadRunnable.run(ThreadFactoryImpl.java:56)
           [exec]         at java.lang.Thread.run(Thread.java:745)
           [exec] 
           [exec]         Caused by:
           [exec]         java.lang.ClassNotFoundException: javax.servlet.http.HttpUpgradeHandler
           [exec]             at java.net.URLClassLoader.findClass(URLClassLoader.java:381)
           [exec]             at java.lang.ClassLoader.loadClass(ClassLoader.java:424)
           [exec]             at sun.misc.Launcher$AppClassLoader.loadClass(Launcher.java:331)
           [exec]             at java.lang.ClassLoader.loadClass(ClassLoader.java:357)
           [exec]             at org.powermock.core.classloader.MockClassLoader.loadModifiedClass(MockClassLoader.java:178)
           [exec]             at org.powermock.core.classloader.DeferSupportingClassLoader.loadClass(DeferSupportingClassLoader.java:68)
           [exec]             at java.lang.ClassLoader.loadClass(ClassLoader.java:357)
           [exec]             ... 63 more
           [exec] 
           [exec] com.liferay.frontend.js.loader.modules.extender.internal.JSLoaderModulesServletTest > testBasicOutput STARTED
           [exec] 
           [exec] com.liferay.frontend.js.loader.modules.extender.internal.JSLoaderModulesServletTest > testBasicOutput FAILED
           [exec]     java.lang.NoClassDefFoundError: javax/servlet/http/HttpUpgradeHandler
           [exec]         at java.lang.Class.getDeclaredMethods0(Native Method)
           [exec]         at java.lang.Class.privateGetDeclaredMethods(Class.java:2701)
           [exec]         at java.lang.Class.getDeclaredMethod(Class.java:2128)
           [exec]         at org.mockito.cglib.proxy.Enhancer.getCallbacksSetter(Enhancer.java:631)
           [exec]         at org.mockito.cglib.proxy.Enhancer.isEnhanced(Enhancer.java:605)
           [exec]         at org.powermock.api.extension.proxyframework.ProxyFrameworkImpl.isProxy(ProxyFrameworkImpl.java:50)
           [exec]         at org.powermock.reflect.internal.WhiteboxImpl.getUnmockedType(WhiteboxImpl.java:1661)
           [exec]         at org.powermock.reflect.internal.WhiteboxImpl.getConstructor(WhiteboxImpl.java:240)
           [exec]         at org.powermock.core.MockGateway.newInstanceCall(MockGateway.java:212)
           [exec]         at com.liferay.frontend.js.loader.modules.extender.internal.JSLoaderModulesServletTest.testBasicOutput(JSLoaderModulesServletTest.java:97)
           [exec]         at sun.reflect.NativeMethodAccessorImpl.invoke0(Native Method)
           [exec]         at sun.reflect.NativeMethodAccessorImpl.invoke(NativeMethodAccessorImpl.java:62)
           [exec]         at sun.reflect.DelegatingMethodAccessorImpl.invoke(DelegatingMethodAccessorImpl.java:43)
           [exec]         at java.lang.reflect.Method.invoke(Method.java:498)
           [exec]         at org.junit.internal.runners.TestMethod.invoke(TestMethod.java:68)
           [exec]         at org.powermock.modules.junit4.internal.impl.PowerMockJUnit44RunnerDelegateImpl$PowerMockJUnit44MethodRunner.runTestMethod(PowerMockJUnit44RunnerDelegateImpl.java:310)
           [exec]         at org.junit.internal.runners.MethodRoadie$2.run(MethodRoadie.java:89)
           [exec]         at org.junit.internal.runners.MethodRoadie.runBeforesThenTestThenAfters(MethodRoadie.java:97)
           [exec]         at org.powermock.modules.junit4.internal.impl.PowerMockJUnit44RunnerDelegateImpl$PowerMockJUnit44MethodRunner.executeTest(PowerMockJUnit44RunnerDelegateImpl.java:294)
           [exec]         at org.powermock.modules.junit4.internal.impl.PowerMockJUnit47RunnerDelegateImpl$PowerMockJUnit47MethodRunner.executeTestInSuper(PowerMockJUnit47RunnerDelegateImpl.java:127)
           [exec]         at org.powermock.modules.junit4.internal.impl.PowerMockJUnit47RunnerDelegateImpl$PowerMockJUnit47MethodRunner.executeTest(PowerMockJUnit47RunnerDelegateImpl.java:82)
           [exec]         at org.powermock.modules.junit4.internal.impl.PowerMockJUnit44RunnerDelegateImpl$PowerMockJUnit44MethodRunner.runBeforesThenTestThenAfters(PowerMockJUnit44RunnerDelegateImpl.java:282)
           [exec]         at org.junit.internal.runners.MethodRoadie.runTest(MethodRoadie.java:87)
           [exec]         at org.junit.internal.runners.MethodRoadie.run(MethodRoadie.java:50)
           [exec]         at org.powermock.modules.junit4.internal.impl.PowerMockJUnit44RunnerDelegateImpl.invokeTestMethod(PowerMockJUnit44RunnerDelegateImpl.java:207)
           [exec]         at org.powermock.modules.junit4.internal.impl.PowerMockJUnit44RunnerDelegateImpl.runMethods(PowerMockJUnit44RunnerDelegateImpl.java:146)
           [exec]         at org.powermock.modules.junit4.internal.impl.PowerMockJUnit44RunnerDelegateImpl$1.run(PowerMockJUnit44RunnerDelegateImpl.java:120)
           [exec]         at org.junit.internal.runners.ClassRoadie.runUnprotected(ClassRoadie.java:34)
           [exec]         at org.junit.internal.runners.ClassRoadie.runProtected(ClassRoadie.java:44)
           [exec]         at org.powermock.modules.junit4.internal.impl.PowerMockJUnit44RunnerDelegateImpl.run(PowerMockJUnit44RunnerDelegateImpl.java:122)
           [exec]         at org.powermock.modules.junit4.common.internal.impl.JUnit4TestSuiteChunkerImpl.run(JUnit4TestSuiteChunkerImpl.java:106)
           [exec]         at org.powermock.modules.junit4.common.internal.impl.AbstractCommonPowerMockRunner.run(AbstractCommonPowerMockRunner.java:53)
           [exec]         at org.powermock.modules.junit4.PowerMockRunner.run(PowerMockRunner.java:59)
           [exec]         at org.gradle.api.internal.tasks.testing.junit.JUnitTestClassExecutor.runTestClass(JUnitTestClassExecutor.java:110)
           [exec]         at org.gradle.api.internal.tasks.testing.junit.JUnitTestClassExecutor.execute(JUnitTestClassExecutor.java:58)
           [exec]         at org.gradle.api.internal.tasks.testing.junit.JUnitTestClassExecutor.execute(JUnitTestClassExecutor.java:38)
           [exec]         at org.gradle.api.internal.tasks.testing.junit.AbstractJUnitTestClassProcessor.processTestClass(AbstractJUnitTestClassProcessor.java:62)
           [exec]         at org.gradle.api.internal.tasks.testing.SuiteTestClassProcessor.processTestClass(SuiteTestClassProcessor.java:51)
           [exec]         at sun.reflect.NativeMethodAccessorImpl.invoke0(Native Method)
           [exec]         at sun.reflect.NativeMethodAccessorImpl.invoke(NativeMethodAccessorImpl.java:62)
           [exec]         at sun.reflect.DelegatingMethodAccessorImpl.invoke(DelegatingMethodAccessorImpl.java:43)
           [exec]         at java.lang.reflect.Method.invoke(Method.java:498)
           [exec]         at org.gradle.internal.dispatch.ReflectionDispatch.dispatch(ReflectionDispatch.java:36)
           [exec]         at org.gradle.internal.dispatch.ReflectionDispatch.dispatch(ReflectionDispatch.java:24)
           [exec]         at org.gradle.internal.dispatch.ContextClassLoaderDispatch.dispatch(ContextClassLoaderDispatch.java:33)
           [exec]         at org.gradle.internal.dispatch.ProxyDispatchAdapter$DispatchingInvocationHandler.invoke(ProxyDispatchAdapter.java:94)
           [exec]         at com.sun.proxy.$Proxy2.processTestClass(Unknown Source)
           [exec]         at org.gradle.api.internal.tasks.testing.worker.TestWorker.processTestClass(TestWorker.java:119)
           [exec]         at sun.reflect.NativeMethodAccessorImpl.invoke0(Native Method)
           [exec]         at sun.reflect.NativeMethodAccessorImpl.invoke(NativeMethodAccessorImpl.java:62)
           [exec]         at sun.reflect.DelegatingMethodAccessorImpl.invoke(DelegatingMethodAccessorImpl.java:43)
           [exec]         at java.lang.reflect.Method.invoke(Method.java:498)
           [exec]         at org.gradle.internal.dispatch.ReflectionDispatch.dispatch(ReflectionDispatch.java:36)
           [exec]         at org.gradle.internal.dispatch.ReflectionDispatch.dispatch(ReflectionDispatch.java:24)
           [exec]         at org.gradle.internal.remote.internal.hub.MessageHubBackedObjectConnection$DispatchWrapper.dispatch(MessageHubBackedObjectConnection.java:182)
           [exec]         at org.gradle.internal.remote.internal.hub.MessageHubBackedObjectConnection$DispatchWrapper.dispatch(MessageHubBackedObjectConnection.java:164)
           [exec]         at org.gradle.internal.remote.internal.hub.MessageHub$Handler.run(MessageHub.java:414)
           [exec]         at org.gradle.internal.concurrent.ExecutorPolicy$CatchAndRecordFailures.onExecute(ExecutorPolicy.java:64)
           [exec]         at org.gradle.internal.concurrent.ManagedExecutorImpl$1.run(ManagedExecutorImpl.java:48)
           [exec]         at java.util.concurrent.ThreadPoolExecutor.runWorker(ThreadPoolExecutor.java:1142)
           [exec]         at java.util.concurrent.ThreadPoolExecutor$Worker.run(ThreadPoolExecutor.java:617)
           [exec]         at org.gradle.internal.concurrent.ThreadFactoryImpl$ManagedThreadRunnable.run(ThreadFactoryImpl.java:56)
           [exec]         at java.lang.Thread.run(Thread.java:745)
           [exec] 
           [exec]         Caused by:
           [exec]         java.lang.ClassNotFoundException: javax.servlet.http.HttpUpgradeHandler
           [exec]             at java.net.URLClassLoader.findClass(URLClassLoader.java:381)
           [exec]             at java.lang.ClassLoader.loadClass(ClassLoader.java:424)
           [exec]             at sun.misc.Launcher$AppClassLoader.loadClass(Launcher.java:331)
           [exec]             at java.lang.ClassLoader.loadClass(ClassLoader.java:357)
           [exec]             at org.powermock.core.classloader.MockClassLoader.loadModifiedClass(MockClassLoader.java:178)
           [exec]             at org.powermock.core.classloader.DeferSupportingClassLoader.loadClass(DeferSupportingClassLoader.java:68)
           [exec]             at java.lang.ClassLoader.loadClass(ClassLoader.java:357)
           [exec]             ... 63 more
           [exec] 
           [exec] com.liferay.frontend.js.loader.modules.extender.internal.JSLoaderModulesServletTest > testMultipleModulesOutput STARTED
           [exec] 
           [exec] com.liferay.frontend.js.loader.modules.extender.internal.JSLoaderModulesServletTest > testMultipleModulesOutput FAILED
           [exec]     java.lang.NoClassDefFoundError: javax/servlet/http/HttpUpgradeHandler
           [exec]         at java.lang.Class.getDeclaredMethods0(Native Method)
           [exec]         at java.lang.Class.privateGetDeclaredMethods(Class.java:2701)
           [exec]         at java.lang.Class.getDeclaredMethod(Class.java:2128)
           [exec]         at org.mockito.cglib.proxy.Enhancer.getCallbacksSetter(Enhancer.java:631)
           [exec]         at org.mockito.cglib.proxy.Enhancer.isEnhanced(Enhancer.java:605)
           [exec]         at org.powermock.api.extension.proxyframework.ProxyFrameworkImpl.isProxy(ProxyFrameworkImpl.java:50)
           [exec]         at org.powermock.reflect.internal.WhiteboxImpl.getUnmockedType(WhiteboxImpl.java:1661)
           [exec]         at org.powermock.reflect.internal.WhiteboxImpl.getConstructor(WhiteboxImpl.java:240)
           [exec]         at org.powermock.core.MockGateway.newInstanceCall(MockGateway.java:212)
           [exec]         at com.liferay.frontend.js.loader.modules.extender.internal.JSLoaderModulesServletTest.testMultipleModulesOutput(JSLoaderModulesServletTest.java:133)
           [exec]         at sun.reflect.NativeMethodAccessorImpl.invoke0(Native Method)
           [exec]         at sun.reflect.NativeMethodAccessorImpl.invoke(NativeMethodAccessorImpl.java:62)
           [exec]         at sun.reflect.DelegatingMethodAccessorImpl.invoke(DelegatingMethodAccessorImpl.java:43)
           [exec]         at java.lang.reflect.Method.invoke(Method.java:498)
           [exec]         at org.junit.internal.runners.TestMethod.invoke(TestMethod.java:68)
           [exec]         at org.powermock.modules.junit4.internal.impl.PowerMockJUnit44RunnerDelegateImpl$PowerMockJUnit44MethodRunner.runTestMethod(PowerMockJUnit44RunnerDelegateImpl.java:310)
           [exec]         at org.junit.internal.runners.MethodRoadie$2.run(MethodRoadie.java:89)
           [exec]         at org.junit.internal.runners.MethodRoadie.runBeforesThenTestThenAfters(MethodRoadie.java:97)
           [exec]         at org.powermock.modules.junit4.internal.impl.PowerMockJUnit44RunnerDelegateImpl$PowerMockJUnit44MethodRunner.executeTest(PowerMockJUnit44RunnerDelegateImpl.java:294)
           [exec]         at org.powermock.modules.junit4.internal.impl.PowerMockJUnit47RunnerDelegateImpl$PowerMockJUnit47MethodRunner.executeTestInSuper(PowerMockJUnit47RunnerDelegateImpl.java:127)
           [exec]         at org.powermock.modules.junit4.internal.impl.PowerMockJUnit47RunnerDelegateImpl$PowerMockJUnit47MethodRunner.executeTest(PowerMockJUnit47RunnerDelegateImpl.java:82)
           [exec]         at org.powermock.modules.junit4.internal.impl.PowerMockJUnit44RunnerDelegateImpl$PowerMockJUnit44MethodRunner.runBeforesThenTestThenAfters(PowerMockJUnit44RunnerDelegateImpl.java:282)
           [exec]         at org.junit.internal.runners.MethodRoadie.runTest(MethodRoadie.java:87)
           [exec]         at org.junit.internal.runners.MethodRoadie.run(MethodRoadie.java:50)
           [exec]         at org.powermock.modules.junit4.internal.impl.PowerMockJUnit44RunnerDelegateImpl.invokeTestMethod(PowerMockJUnit44RunnerDelegateImpl.java:207)
           [exec]         at org.powermock.modules.junit4.internal.impl.PowerMockJUnit44RunnerDelegateImpl.runMethods(PowerMockJUnit44RunnerDelegateImpl.java:146)
           [exec]         at org.powermock.modules.junit4.internal.impl.PowerMockJUnit44RunnerDelegateImpl$1.run(PowerMockJUnit44RunnerDelegateImpl.java:120)
           [exec]         at org.junit.internal.runners.ClassRoadie.runUnprotected(ClassRoadie.java:34)
           [exec]         at org.junit.internal.runners.ClassRoadie.runProtected(ClassRoadie.java:44)
           [exec]         at org.powermock.modules.junit4.internal.impl.PowerMockJUnit44RunnerDelegateImpl.run(PowerMockJUnit44RunnerDelegateImpl.java:122)
           [exec]         at org.powermock.modules.junit4.common.internal.impl.JUnit4TestSuiteChunkerImpl.run(JUnit4TestSuiteChunkerImpl.java:106)
           [exec]         at org.powermock.modules.junit4.common.internal.impl.AbstractCommonPowerMockRunner.run(AbstractCommonPowerMockRunner.java:53)
           [exec]         at org.powermock.modules.junit4.PowerMockRunner.run(PowerMockRunner.java:59)
           [exec]         at org.gradle.api.internal.tasks.testing.junit.JUnitTestClassExecutor.runTestClass(JUnitTestClassExecutor.java:110)
           [exec]         at org.gradle.api.internal.tasks.testing.junit.JUnitTestClassExecutor.execute(JUnitTestClassExecutor.java:58)
           [exec]         at org.gradle.api.internal.tasks.testing.junit.JUnitTestClassExecutor.execute(JUnitTestClassExecutor.java:38)
           [exec]         at org.gradle.api.internal.tasks.testing.junit.AbstractJUnitTestClassProcessor.processTestClass(AbstractJUnitTestClassProcessor.java:62)
           [exec]         at org.gradle.api.internal.tasks.testing.SuiteTestClassProcessor.processTestClass(SuiteTestClassProcessor.java:51)
           [exec]         at sun.reflect.NativeMethodAccessorImpl.invoke0(Native Method)
           [exec]         at sun.reflect.NativeMethodAccessorImpl.invoke(NativeMethodAccessorImpl.java:62)
           [exec]         at sun.reflect.DelegatingMethodAccessorImpl.invoke(DelegatingMethodAccessorImpl.java:43)
           [exec]         at java.lang.reflect.Method.invoke(Method.java:498)
           [exec]         at org.gradle.internal.dispatch.ReflectionDispatch.dispatch(ReflectionDispatch.java:36)
           [exec]         at org.gradle.internal.dispatch.ReflectionDispatch.dispatch(ReflectionDispatch.java:24)
           [exec]         at org.gradle.internal.dispatch.ContextClassLoaderDispatch.dispatch(ContextClassLoaderDispatch.java:33)
           [exec]         at org.gradle.internal.dispatch.ProxyDispatchAdapter$DispatchingInvocationHandler.invoke(ProxyDispatchAdapter.java:94)
           [exec]         at com.sun.proxy.$Proxy2.processTestClass(Unknown Source)
           [exec]         at org.gradle.api.internal.tasks.testing.worker.TestWorker.processTestClass(TestWorker.java:119)
           [exec]         at sun.reflect.NativeMethodAccessorImpl.invoke0(Native Method)
           [exec]         at sun.reflect.NativeMethodAccessorImpl.invoke(NativeMethodAccessorImpl.java:62)
           [exec]         at sun.reflect.DelegatingMethodAccessorImpl.invoke(DelegatingMethodAccessorImpl.java:43)
           [exec]         at java.lang.reflect.Method.invoke(Method.java:498)
           [exec]         at org.gradle.internal.dispatch.ReflectionDispatch.dispatch(ReflectionDispatch.java:36)
           [exec]         at org.gradle.internal.dispatch.ReflectionDispatch.dispatch(ReflectionDispatch.java:24)
           [exec]         at org.gradle.internal.remote.internal.hub.MessageHubBackedObjectConnection$DispatchWrapper.dispatch(MessageHubBackedObjectConnection.java:182)
           [exec]         at org.gradle.internal.remote.internal.hub.MessageHubBackedObjectConnection$DispatchWrapper.dispatch(MessageHubBackedObjectConnection.java:164)
           [exec]         at org.gradle.internal.remote.internal.hub.MessageHub$Handler.run(MessageHub.java:414)
           [exec]         at org.gradle.internal.concurrent.ExecutorPolicy$CatchAndRecordFailures.onExecute(ExecutorPolicy.java:64)
           [exec]         at org.gradle.internal.concurrent.ManagedExecutorImpl$1.run(ManagedExecutorImpl.java:48)
           [exec]         at java.util.concurrent.ThreadPoolExecutor.runWorker(ThreadPoolExecutor.java:1142)
           [exec]         at java.util.concurrent.ThreadPoolExecutor$Worker.run(ThreadPoolExecutor.java:617)
           [exec]         at org.gradle.internal.concurrent.ThreadFactoryImpl$ManagedThreadRunnable.run(ThreadFactoryImpl.java:56)
           [exec]         at java.lang.Thread.run(Thread.java:745)
           [exec] 
           [exec]         Caused by:
           [exec]         java.lang.ClassNotFoundException: javax.servlet.http.HttpUpgradeHandler
           [exec]             at java.net.URLClassLoader.findClass(URLClassLoader.java:381)
           [exec]             at java.lang.ClassLoader.loadClass(ClassLoader.java:424)
           [exec]             at sun.misc.Launcher$AppClassLoader.loadClass(Launcher.java:331)
           [exec]             at java.lang.ClassLoader.loadClass(ClassLoader.java:357)
           [exec]             at org.powermock.core.classloader.MockClassLoader.loadModifiedClass(MockClassLoader.java:178)
           [exec]             at org.powermock.core.classloader.DeferSupportingClassLoader.loadClass(DeferSupportingClassLoader.java:68)
           [exec]             at java.lang.ClassLoader.loadClass(ClassLoader.java:357)
           [exec]             ... 63 more
           [exec] 
           [exec] com.liferay.frontend.js.loader.modules.extender.internal.JSLoaderModulesServletTest > testSingleModuleOutputEmptyConfiguration STARTED
           [exec] 
           [exec] com.liferay.frontend.js.loader.modules.extender.internal.JSLoaderModulesServletTest > testSingleModuleOutputEmptyConfiguration PASSED
           [exec] There were failing tests. See the report at: file:///opt/dev/projects/github/liferay-portal-7.1.x/modules/apps/frontend-js/frontend-js-loader-modules-extender/build/reports/tests/test/index.html
           [exec] 
           [exec] > Task :apps:frontend-js:frontend-js-loader-modules-extender-api:compileTestJava
           [exec] > Task :apps:frontend-js:frontend-js-loader-modules-extender-api:processTestResources NO-SOURCE
           [exec] > Task :apps:frontend-js:frontend-js-loader-modules-extender-api:testClasses
           [exec] 
           [exec] 8 tests completed, 6 failed
      

        Attachments

          Activity

            People

            Assignee:
            support-lep@liferay.com SE Support
            Reporter:
            harry.chai Harry Chai
            Participants of an Issue:
            Recent user:
            Brian Wulbern
            Votes:
            0 Vote for this issue
            Watchers:
            0 Start watching this issue

              Dates

              Created:
              Updated:
              Days since last comment:
              25 weeks, 3 days ago

                Packages

                Version Package