Uploaded image for project: 'PUBLIC - Liferay Portal Community Edition'
  1. PUBLIC - Liferay Portal Community Edition
  2. LPS-134887

AssetCategoryServiceTest test failed on 7.1.x

    Details

    • Type: Regression Bug
    • Status: Verified
    • Resolution: Unresolved
    • Affects Version/s: 7.1.X
    • Fix Version/s: None
    • Component/s: Categories
    • Quality Gate:
      Gauntlet Test Analysis

      Description

      Issue:

           [exec] com.liferay.asset.service.test.AssetCategoryServiceTest > testUniqueCategoryIdsWhenAddingCategoriesSimultaneously STARTED
           [exec] 
           [exec] 21:43:30,097 ERROR [pool-18-thread-1][JDBCExceptionReporter:234] Deadlock found when trying to get lock; try restarting transaction
           [exec] Deadlock found when trying to get lock; try restarting transaction
           [exec] 21:43:30,101 ERROR [pool-18-thread-1][BasePersistenceImpl:263] Caught unexpected exception
           [exec] com.liferay.portal.kernel.exception.SystemException: com.liferay.portal.kernel.dao.orm.ORMException: org.hibernate.exception.LockAcquisitionException: could not execute native bulk manipulation query
           [exec] 	at com.liferay.portal.kernel.service.persistence.impl.BasePersistenceImpl.processException(BasePersistenceImpl.java:269)
           [exec] 	at com.liferay.portal.kernel.service.persistence.impl.PersistenceNestedSetsTreeManager.doUpdate(PersistenceNestedSetsTreeManager.java:392)
           [exec] 	at com.liferay.portal.kernel.service.persistence.impl.NestedSetsTreeManager.insert(NestedSetsTreeManager.java:75)
           [exec] 	at com.liferay.portlet.asset.service.persistence.impl.AssetCategoryPersistenceImpl.updateImpl(AssetCategoryPersistenceImpl.java:12405)
           [exec] 	at com.liferay.portlet.asset.service.persistence.impl.AssetCategoryPersistenceImpl.updateImpl(AssetCategoryPersistenceImpl.java:80)
           [exec] 	at com.liferay.portal.kernel.service.persistence.impl.BasePersistenceImpl.update(BasePersistenceImpl.java:356)
           [exec] 	at com.liferay.portlet.asset.service.impl.AssetCategoryLocalServiceImpl.addCategory(AssetCategoryLocalServiceImpl.java:134)
           [exec] 	at sun.reflect.GeneratedMethodAccessor1742.invoke(Unknown Source)
           [exec] 	at sun.reflect.DelegatingMethodAccessorImpl.invoke(DelegatingMethodAccessorImpl.java:43)
           [exec] 	at java.lang.reflect.Method.invoke(Method.java:498)
           [exec] 	at com.liferay.portal.kernel.bean.ClassLoaderBeanHandler.invoke(ClassLoaderBeanHandler.java:66)
           [exec] 	at com.sun.proxy.$Proxy553.addCategory(Unknown Source)
           [exec] 	at com.liferay.asset.kernel.service.AssetCategoryLocalServiceWrapper.addCategory(AssetCategoryLocalServiceWrapper.java:93)
           [exec] 	at sun.reflect.GeneratedMethodAccessor1742.invoke(Unknown Source)
           [exec] 	at sun.reflect.DelegatingMethodAccessorImpl.invoke(DelegatingMethodAccessorImpl.java:43)
           [exec] 	at java.lang.reflect.Method.invoke(Method.java:498)
           [exec] 	at com.liferay.portal.kernel.bean.ClassLoaderBeanHandler.invoke(ClassLoaderBeanHandler.java:66)
           [exec] 	at com.sun.proxy.$Proxy554.addCategory(Unknown Source)
           [exec] 	at com.liferay.asset.kernel.service.AssetCategoryLocalServiceWrapper.addCategory(AssetCategoryLocalServiceWrapper.java:93)
           [exec] 	at com.liferay.asset.categories.internal.service.AssetCategoryPropertyAssetCategoryLocalServiceWrapper.addCategory(AssetCategoryPropertyAssetCategoryLocalServiceWrapper.java:66)
           [exec] 	at sun.reflect.GeneratedMethodAccessor1742.invoke(Unknown Source)
           [exec] 	at sun.reflect.DelegatingMethodAccessorImpl.invoke(DelegatingMethodAccessorImpl.java:43)
           [exec] 	at java.lang.reflect.Method.invoke(Method.java:498)
           [exec] 	at com.liferay.portal.kernel.bean.ClassLoaderBeanHandler.invoke(ClassLoaderBeanHandler.java:66)
           [exec] 	at com.sun.proxy.$Proxy554.addCategory(Unknown Source)
           [exec] 	at sun.reflect.GeneratedMethodAccessor1742.invoke(Unknown Source)
           [exec] 	at sun.reflect.DelegatingMethodAccessorImpl.invoke(DelegatingMethodAccessorImpl.java:43)
           [exec] 	at java.lang.reflect.Method.invoke(Method.java:498)
           [exec] 	at com.liferay.portal.spring.aop.ServiceBeanMethodInvocation.proceed(ServiceBeanMethodInvocation.java:153)
           [exec] 	at com.liferay.portal.spring.transaction.DefaultTransactionExecutor._execute(DefaultTransactionExecutor.java:203)
           [exec] 	at com.liferay.portal.spring.transaction.DefaultTransactionExecutor.execute(DefaultTransactionExecutor.java:94)
           [exec] 	at com.liferay.portal.spring.transaction.TransactionInterceptor.invoke(TransactionInterceptor.java:110)
           [exec] 	at com.liferay.portal.spring.aop.ServiceBeanMethodInvocation.proceed(ServiceBeanMethodInvocation.java:130)
           [exec] 	at com.liferay.portal.service.ServiceContextAdvice.invoke(ServiceContextAdvice.java:51)
           [exec] 	at com.liferay.portal.spring.aop.ServiceBeanMethodInvocation.proceed(ServiceBeanMethodInvocation.java:130)
           [exec] 	at com.liferay.portal.spring.aop.ChainableMethodAdvice.invoke(ChainableMethodAdvice.java:55)
           [exec] 	at com.liferay.portal.spring.aop.ServiceBeanMethodInvocation.proceed(ServiceBeanMethodInvocation.java:130)
           [exec] 	at com.liferay.portal.spring.aop.ChainableMethodAdvice.invoke(ChainableMethodAdvice.java:55)
           [exec] 	at com.liferay.portal.spring.aop.ServiceBeanMethodInvocation.proceed(ServiceBeanMethodInvocation.java:130)
           [exec] 	at com.liferay.portal.spring.aop.ServiceBeanAopProxy.invoke(ServiceBeanAopProxy.java:125)
           [exec] 	at com.sun.proxy.$Proxy66.addCategory(Unknown Source)
           [exec] 	at com.liferay.asset.kernel.service.AssetCategoryLocalServiceUtil.addCategory(AssetCategoryLocalServiceUtil.java:94)
           [exec] 	at com.liferay.asset.test.util.AssetTestUtil.addCategory(AssetTestUtil.java:95)
           [exec] 	at com.liferay.asset.service.test.AssetCategoryServiceTest.lambda$testUniqueCategoryIdsWhenAddingCategoriesSimultaneously$1(AssetCategoryServiceTest.java:158)
           [exec] 	at java.util.concurrent.FutureTask.run(FutureTask.java:266)
           [exec] 	at java.util.concurrent.ThreadPoolExecutor.runWorker(ThreadPoolExecutor.java:1142)
           [exec] 	at java.util.concurrent.ThreadPoolExecutor$Worker.run(ThreadPoolExecutor.java:617)
           [exec] 	at java.lang.Thread.run(Thread.java:745)
           [exec] Caused by: com.liferay.portal.kernel.dao.orm.ORMException: org.hibernate.exception.LockAcquisitionException: could not execute native bulk manipulation query
           [exec] 	at com.liferay.portal.dao.orm.hibernate.ExceptionTranslator.translate(ExceptionTranslator.java:39)
           [exec] 	at com.liferay.portal.dao.orm.hibernate.SQLQueryImpl.executeUpdate(SQLQueryImpl.java:127)
           [exec] 	at com.liferay.portal.kernel.service.persistence.impl.PersistenceNestedSetsTreeManager.doUpdate(PersistenceNestedSetsTreeManager.java:389)
           [exec] 	... 46 more
           [exec] Caused by: org.hibernate.exception.LockAcquisitionException: could not execute native bulk manipulation query
           [exec] 	at org.hibernate.exception.SQLStateConverter.convert(SQLStateConverter.java:107)
           [exec] 	at org.hibernate.exception.JDBCExceptionHelper.convert(JDBCExceptionHelper.java:66)
           [exec] 	at org.hibernate.engine.query.NativeSQLQueryPlan.performExecuteUpdate(NativeSQLQueryPlan.java:219)
           [exec] 	at org.hibernate.impl.SessionImpl.executeNativeUpdate(SessionImpl.java:1310)
           [exec] 	at org.hibernate.impl.SQLQueryImpl.executeUpdate(SQLQueryImpl.java:396)
           [exec] 	at com.liferay.portal.dao.orm.hibernate.SQLQueryImpl.executeUpdate(SQLQueryImpl.java:124)
           [exec] 	... 47 more
           [exec] Caused by: com.mysql.cj.jdbc.exceptions.MySQLTransactionRollbackException: Deadlock found when trying to get lock; try restarting transaction
           [exec] 	at com.mysql.cj.jdbc.exceptions.SQLError.createSQLException(SQLError.java:123)
           [exec] 	at com.mysql.cj.jdbc.exceptions.SQLError.createSQLException(SQLError.java:97)
           [exec] 	at com.mysql.cj.jdbc.exceptions.SQLExceptionsMapping.translateException(SQLExceptionsMapping.java:122)
           [exec] 	at com.mysql.cj.jdbc.ClientPreparedStatement.executeInternal(ClientPreparedStatement.java:953)
           [exec] 	at com.mysql.cj.jdbc.ClientPreparedStatement.executeUpdateInternal(ClientPreparedStatement.java:1092)
           [exec] 	at com.mysql.cj.jdbc.ClientPreparedStatement.executeUpdateInternal(ClientPreparedStatement.java:1040)
           [exec] 	at com.mysql.cj.jdbc.ClientPreparedStatement.executeLargeUpdate(ClientPreparedStatement.java:1347)
           [exec] 	at com.mysql.cj.jdbc.ClientPreparedStatement.executeUpdate(ClientPreparedStatement.java:1025)
           [exec] 	at com.zaxxer.hikari.pool.ProxyPreparedStatement.executeUpdate(ProxyPreparedStatement.java:61)
           [exec] 	at com.zaxxer.hikari.pool.HikariProxyPreparedStatement.executeUpdate(HikariProxyPreparedStatement.java)
           [exec] 	at org.hibernate.engine.query.NativeSQLQueryPlan.performExecuteUpdate(NativeSQLQueryPlan.java:210)
           [exec] 	... 50 more
           [exec] 
           [exec] > Task :apps:asset:asset-test:testIntegration
           [exec] 
           [exec] com.liferay.asset.service.test.AssetCategoryServiceTest > testUniqueCategoryIdsWhenAddingCategoriesSimultaneously FAILED
           [exec]     java.lang.AssertionError: Thread Thread[pool-18-thread-1,5,] caught concurrent failure: java.lang.AssertionError: {level=ERROR, loggerName=com.liferay.portal.kernel.service.persistence.impl.BasePersistenceImpl, message=Caught unexpected exception
           [exec]     java.lang.AssertionError: {level=ERROR, loggerName=com.liferay.portal.kernel.service.persistence.impl.BasePersistenceImpl, message=Caught unexpected exception
           [exec]     	at com.liferay.portal.test.rule.LogAssertionAppender.append(LogAssertionAppender.java:61)
           [exec]     	at org.apache.log4j.AppenderSkeleton.doAppend(AppenderSkeleton.java:251)
           [exec]     	at org.apache.log4j.helpers.AppenderAttachableImpl.appendLoopOnAppenders(AppenderAttachableImpl.java:66)
           [exec]     	at org.apache.log4j.Category.callAppenders(Category.java:206)
           [exec]     	at org.apache.log4j.Category.forcedLog(Category.java:391)
           [exec]     	at org.apache.log4j.Category.log(Category.java:856)
           [exec]     	at com.liferay.portal.log.Log4jLogImpl.error(Log4jLogImpl.java:54)
           [exec]     	at com.liferay.portal.kernel.log.LogWrapper.error(LogWrapper.java:69)
           [exec]     	at com.liferay.portal.kernel.service.persistence.impl.BasePersistenceImpl.processException(BasePersistenceImpl.java:263)
           [exec]     	at com.liferay.portlet.asset.service.persistence.impl.AssetCategoryPersistenceImpl.updateImpl(AssetCategoryPersistenceImpl.java:12436)
           [exec]     	at com.liferay.portlet.asset.service.persistence.impl.AssetCategoryPersistenceImpl.updateImpl(AssetCategoryPersistenceImpl.java:80)
           [exec]     	at com.liferay.portal.kernel.service.persistence.impl.BasePersistenceImpl.update(BasePersistenceImpl.java:356)
           [exec]     	at com.liferay.portlet.asset.service.impl.AssetCategoryLocalServiceImpl.addCategory(AssetCategoryLocalServiceImpl.java:134)
           [exec]     	at sun.reflect.GeneratedMethodAccessor1742.invoke(Unknown Source)
           [exec]     	at sun.reflect.DelegatingMethodAccessorImpl.invoke(DelegatingMethodAccessorImpl.java:43)
           [exec]     	at java.lang.reflect.Method.invoke(Method.java:498)
           [exec]     	at com.liferay.portal.kernel.bean.ClassLoaderBeanHandler.invoke(ClassLoaderBeanHandler.java:66)
           [exec]     	at com.sun.proxy.$Proxy553.addCategory(Unknown Source)
           [exec]     	at com.liferay.asset.kernel.service.AssetCategoryLocalServiceWrapper.addCategory(AssetCategoryLocalServiceWrapper.java:93)
           [exec]     	at sun.reflect.GeneratedMethodAccessor1742.invoke(Unknown Source)
           [exec]     	at sun.reflect.DelegatingMethodAccessorImpl.invoke(DelegatingMethodAccessorImpl.java:43)
           [exec]     	at java.lang.reflect.Method.invoke(Method.java:498)
           [exec]     	at com.liferay.portal.kernel.bean.ClassLoaderBeanHandler.invoke(ClassLoaderBeanHandler.java:66)
           [exec]     	at com.sun.proxy.$Proxy554.addCategory(Unknown Source)
           [exec]     	at com.liferay.asset.kernel.service.AssetCategoryLocalServiceWrapper.addCategory(AssetCategoryLocalServiceWrapper.java:93)
           [exec]     	at com.liferay.asset.categories.internal.service.AssetCategoryPropertyAssetCategoryLocalServiceWrapper.addCategory(AssetCategoryPropertyAssetCategoryLocalServiceWrapper.java:66)
           [exec]     	at sun.reflect.GeneratedMethodAccessor1742.invoke(Unknown Source)
           [exec]     	at sun.reflect.DelegatingMethodAccessorImpl.invoke(DelegatingMethodAccessorImpl.java:43)
           [exec]     	at java.lang.reflect.Method.invoke(Method.java:498)
           [exec]     	at com.liferay.portal.kernel.bean.ClassLoaderBeanHandler.invoke(ClassLoaderBeanHandler.java:66)
           [exec]     	at com.sun.proxy.$Proxy554.addCategory(Unknown Source)
           [exec]     	at sun.reflect.GeneratedMethodAccessor1742.invoke(Unknown Source)
           [exec]     	at sun.reflect.DelegatingMethodAccessorImpl.invoke(DelegatingMethodAccessorImpl.java:43)
           [exec]     	at java.lang.reflect.Method.invoke(Method.java:498)
           [exec]     	at com.liferay.portal.spring.aop.ServiceBeanMethodInvocation.proceed(ServiceBeanMethodInvocation.java:153)
           [exec]     	at com.liferay.portal.spring.transaction.DefaultTransactionExecutor._execute(DefaultTransactionExecutor.java:203)
           [exec]     	at com.liferay.portal.spring.transaction.DefaultTransactionExecutor.execute(DefaultTransactionExecutor.java:94)
           [exec]     	at com.liferay.portal.spring.transaction.TransactionInterceptor.invoke(TransactionInterceptor.java:110)
           [exec]     	at com.liferay.portal.spring.aop.ServiceBeanMethodInvocation.proceed(ServiceBeanMethodInvocation.java:130)
           [exec]     	at com.liferay.portal.service.ServiceContextAdvice.invoke(ServiceContextAdvice.java:51)
           [exec]     	at com.liferay.portal.spring.aop.ServiceBeanMethodInvocation.proceed(ServiceBeanMethodInvocation.java:130)
           [exec]     	at com.liferay.portal.spring.aop.ChainableMethodAdvice.invoke(ChainableMethodAdvice.java:55)
           [exec]     	at com.liferay.portal.spring.aop.ServiceBeanMethodInvocation.proceed(ServiceBeanMethodInvocation.java:130)
           [exec]     	at com.liferay.portal.spring.aop.ChainableMethodAdvice.invoke(ChainableMethodAdvice.java:55)
           [exec]     	at com.liferay.portal.spring.aop.ServiceBeanMethodInvocation.proceed(ServiceBeanMethodInvocation.java:130)
           [exec]     	at com.liferay.portal.spring.aop.ServiceBeanAopProxy.invoke(ServiceBeanAopProxy.java:125)
           [exec]     	at com.sun.proxy.$Proxy66.addCategory(Unknown Source)
           [exec]     	at com.liferay.asset.kernel.service.AssetCategoryLocalServiceUtil.addCategory(AssetCategoryLocalServiceUtil.java:94)
           [exec]     	at com.liferay.asset.test.util.AssetTestUtil.addCategory(AssetTestUtil.java:95)
           [exec]     	at com.liferay.asset.service.test.AssetCategoryServiceTest.lambda$testUniqueCategoryIdsWhenAddingCategoriesSimultaneously$1(AssetCategoryServiceTest.java:158)
           [exec]     	at java.util.concurrent.FutureTask.run(FutureTask.java:266)
           [exec]     	at java.util.concurrent.ThreadPoolExecutor.runWorker(ThreadPoolExecutor.java:1142)
           [exec]     	at java.util.concurrent.ThreadPoolExecutor$Worker.run(ThreadPoolExecutor.java:617)
           [exec]     	at java.lang.Thread.run(Thread.java:745)
           [exec]     Caused by: com.liferay.portal.kernel.exception.SystemException: com.liferay.portal.kernel.dao.orm.ORMException: org.hibernate.exception.LockAcquisitionException: could not execute native bulk manipulation query
           [exec]     	at com.liferay.portal.kernel.service.persistence.impl.BasePersistenceImpl.processException(BasePersistenceImpl.java:269)
           [exec]     	at com.liferay.portal.kernel.service.persistence.impl.PersistenceNestedSetsTreeManager.doUpdate(PersistenceNestedSetsTreeManager.java:392)
           [exec]     	at com.liferay.portal.kernel.service.persistence.impl.NestedSetsTreeManager.insert(NestedSetsTreeManager.java:75)
           [exec]     	at com.liferay.portlet.asset.service.persistence.impl.AssetCategoryPersistenceImpl.updateImpl(AssetCategoryPersistenceImpl.java:12405)
           [exec]     	... 44 more
           [exec]     Caused by: com.liferay.portal.kernel.dao.orm.ORMException: org.hibernate.exception.LockAcquisitionException: could not execute native bulk manipulation query
           [exec]     	at com.liferay.portal.dao.orm.hibernate.ExceptionTranslator.translate(ExceptionTranslator.java:39)
           [exec]     	at com.liferay.portal.dao.orm.hibernate.SQLQueryImpl.executeUpdate(SQLQueryImpl.java:127)
           [exec]     	at com.liferay.portal.kernel.service.persistence.impl.PersistenceNestedSetsTreeManager.doUpdate(PersistenceNestedSetsTreeManager.java:389)
           [exec]     	... 46 more
           [exec]     Caused by: org.hibernate.exception.LockAcquisitionException: could not execute native bulk manipulation query
           [exec]     	at org.hibernate.exception.SQLStateConverter.convert(SQLStateConverter.java:107)
           [exec]     	at org.hibernate.exception.JDBCExceptionHelper.convert(JDBCExceptionHelper.java:66)
           [exec]     	at org.hibernate.engine.query.NativeSQLQueryPlan.performExecuteUpdate(NativeSQLQueryPlan.java:219)
           [exec]     	at org.hibernate.impl.SessionImpl.executeNativeUpdate(SessionImpl.java:1310)
           [exec]     	at org.hibernate.impl.SQLQueryImpl.executeUpdate(SQLQueryImpl.java:396)
           [exec]     	at com.liferay.portal.dao.orm.hibernate.SQLQueryImpl.executeUpdate(SQLQueryImpl.java:124)
           [exec]     	... 47 more
           [exec]     Caused by: com.mysql.cj.jdbc.exceptions.MySQLTransactionRollbackException: Deadlock found when trying to get lock; try restarting transaction
           [exec]     	at com.mysql.cj.jdbc.exceptions.SQLError.createSQLException(SQLError.java:123)
           [exec]     	at com.mysql.cj.jdbc.exceptions.SQLError.createSQLException(SQLError.java:97)
           [exec]     	at com.mysql.cj.jdbc.exceptions.SQLExceptionsMapping.translateException(SQLExceptionsMapping.java:122)
           [exec]     	at com.mysql.cj.jdbc.ClientPreparedStatement.executeInternal(ClientPreparedStatement.java:953)
           [exec]     	at com.mysql.cj.jdbc.ClientPreparedStatement.executeUpdateInternal(ClientPreparedStatement.java:1092)
           [exec]     	at com.mysql.cj.jdbc.ClientPreparedStatement.executeUpdateInternal(ClientPreparedStatement.java:1040)
           [exec]     	at com.mysql.cj.jdbc.ClientPreparedStatement.executeLargeUpdate(ClientPreparedStatement.java:1347)
           [exec]     	at com.mysql.cj.jdbc.ClientPreparedStatement.executeUpdate(ClientPreparedStatement.java:1025)
           [exec]     	at com.zaxxer.hikari.pool.ProxyPreparedStatement.executeUpdate(ProxyPreparedStatement.java:61)
           [exec]     	at com.zaxxer.hikari.pool.HikariProxyPreparedStatement.executeUpdate(HikariProxyPreparedStatement.java)
           [exec]     	at org.hibernate.engine.query.NativeSQLQueryPlan.performExecuteUpdate(NativeSQLQueryPlan.java:210)
           [exec]     	... 50 more
           [exec] 
           [exec]     	at org.junit.Assert.fail(Assert.java:88)
           [exec]     	at com.liferay.portal.test.rule.callback.LogAssertionTestCallback.endAssert(LogAssertionTestCallback.java:130)
           [exec]     	at com.liferay.portal.test.rule.callback.LogAssertionTestCallback.afterClass(LogAssertionTestCallback.java:188)
           [exec]     	at com.liferay.portal.test.rule.callback.LogAssertionTestCallback.afterMethod(LogAssertionTestCallback.java:196)
           [exec]     	at com.liferay.portal.test.rule.callback.LogAssertionTestCallback.afterMethod(LogAssertionTestCallback.java:51)
           [exec]     	at com.liferay.portal.kernel.test.rule.BaseTestRule$1.evaluate(BaseTestRule.java:58)
           [exec]     	at com.liferay.portal.kernel.test.rule.TimeoutTestRule$1.evaluate(TimeoutTestRule.java:89)
           [exec]     	at org.junit.rules.RunRules.evaluate(RunRules.java:20)
           [exec]     	at com.liferay.arquillian.extension.junit.bridge.server.TestExecutorRunnable$1.evaluate(TestExecutorRunnable.java:143)
           [exec]     	at com.liferay.portal.kernel.test.rule.BaseTestRule$2.evaluate(BaseTestRule.java:72)
           [exec]     	at com.liferay.portal.kernel.test.rule.BaseTestRule$2.evaluate(BaseTestRule.java:72)
           [exec]     	at com.liferay.portal.kernel.test.rule.BaseTestRule$2.evaluate(BaseTestRule.java:72)
           [exec]     	at com.liferay.portal.kernel.test.rule.BaseTestRule$2.evaluate(BaseTestRule.java:72)
           [exec]     	at com.liferay.portal.kernel.test.rule.BaseTestRule$2.evaluate(BaseTestRule.java:72)
           [exec]     	at com.liferay.portal.kernel.test.rule.BaseTestRule$2.evaluate(BaseTestRule.java:72)
           [exec]     	at com.liferay.portal.kernel.test.rule.BaseTestRule$2.evaluate(BaseTestRule.java:72)
           [exec]     	at com.liferay.portal.kernel.test.rule.BaseTestRule$2.evaluate(BaseTestRule.java:72)
           [exec]     	at com.liferay.portal.kernel.test.rule.BaseTestRule$2.evaluate(BaseTestRule.java:72)
           [exec]     	at com.liferay.portal.kernel.test.rule.BaseTestRule$2.evaluate(BaseTestRule.java:72)
           [exec]     	at com.liferay.portal.test.rule.LiferayIntegrationTestRule$1$1.evaluate(LiferayIntegrationTestRule.java:154)
           [exec]     	at com.liferay.portal.kernel.test.rule.BaseTestRule$2.evaluate(BaseTestRule.java:72)
           [exec]     	at org.junit.rules.RunRules.evaluate(RunRules.java:20)
           [exec]     	at com.liferay.arquillian.extension.junit.bridge.server.TestExecutorRunnable._execute(TestExecutorRunnable.java:181)
           [exec]     	at com.liferay.arquillian.extension.junit.bridge.server.TestExecutorRunnable.run(TestExecutorRunnable.java:95)
           [exec]     	at java.lang.Thread.run(Thread.java:745)
      

      Full log:
      https://test-1-9.liferay.com/job/test-portal-acceptance-upstream-dxp-batch(7.1.x)/AXIS_VARIABLE=1,label_exp=!master/2416/consoleFull

      modules-integration-mysql57-jdk8/0

        Attachments

          Activity

            People

            Assignee:
            support-lep@liferay.com SE Support
            Reporter:
            harry.chai Harry Chai
            Participants of an Issue:
            Recent user:
            Harry Chai
            Votes:
            0 Vote for this issue
            Watchers:
            0 Start watching this issue

              Dates

              Created:
              Updated:
              Days since last comment:
              12 weeks, 5 days ago

                Packages

                Version Package