Details

    Description

      Test failures

           [exec] com.liferay.data.cleanup.test.DataCleanupTest > testDeprecatedModulesUpgradeDictionary FAILED
           [exec]     java.lang.AssertionError: expected null, but was:<com_liferay_dictionary_web_portlet_DictionaryPortlet>
           [exec]     	at org.junit.Assert.fail(Assert.java:89)
           [exec]     	at org.junit.Assert.failNotNull(Assert.java:756)
           [exec]     	at org.junit.Assert.assertNull(Assert.java:738)
           [exec]     	at org.junit.Assert.assertNull(Assert.java:748)
           [exec]     	at com.liferay.data.cleanup.test.DataCleanupTest._testDeprecatedModulesUpgrade(DataCleanupTest.java:237)
           [exec]     	at com.liferay.data.cleanup.test.DataCleanupTest.testDeprecatedModulesUpgradeDictionary(DataCleanupTest.java:89)
      
           [exec] com.liferay.data.cleanup.test.DataCleanupTest > testDeprecatedModulesUpgradeDirectory FAILED
           [exec]     java.lang.AssertionError: expected null, but was:<com_liferay_directory_web_portlet_DirectoryPortlet>
           [exec]     	at org.junit.Assert.fail(Assert.java:89)
           [exec]     	at org.junit.Assert.failNotNull(Assert.java:756)
           [exec]     	at org.junit.Assert.assertNull(Assert.java:738)
           [exec]     	at org.junit.Assert.assertNull(Assert.java:748)
           [exec]     	at com.liferay.data.cleanup.test.DataCleanupTest._testDeprecatedModulesUpgrade(DataCleanupTest.java:237)
           [exec]     	at com.liferay.data.cleanup.test.DataCleanupTest.testDeprecatedModulesUpgradeDirectory(DataCleanupTest.java:96)
      
           [exec] com.liferay.data.cleanup.test.DataCleanupTest > testDeprecatedModulesUpgradeHelloWorld FAILED
           [exec]     java.lang.AssertionError: expected null, but was:<com_liferay_hello_world_web_portlet_HelloWorldPortlet>
           [exec]     	at org.junit.Assert.fail(Assert.java:89)
           [exec]     	at org.junit.Assert.failNotNull(Assert.java:756)
           [exec]     	at org.junit.Assert.assertNull(Assert.java:738)
           [exec]     	at org.junit.Assert.assertNull(Assert.java:748)
           [exec]     	at com.liferay.data.cleanup.test.DataCleanupTest._testDeprecatedModulesUpgrade(DataCleanupTest.java:237)
           [exec]     	at com.liferay.data.cleanup.test.DataCleanupTest.testDeprecatedModulesUpgradeHelloWorld(DataCleanupTest.java:103)
      

      Testray

      Logs

      Attachments

        Issue Links

          Activity

            People

              victor.ware Victor Ware
              victor.ware Victor Ware
              Marta Elicegui Marta Elicegui
              Kevin Lee Kevin Lee
              Votes:
              0 Vote for this issue
              Watchers:
              0 Start watching this issue

              Dates

                Created:
                Updated:
                Resolved:
                1 year, 14 weeks, 5 days ago

                Packages

                  Version Package
                  7.4.2 CE GA3 DXP 7,4
                  7.4.13 DXP GA1
                  7.4.3.4 CE GA4
                  Master